##TITLE= spectra-data from xy
##JCAMP-DX= 5.00	$$Cheminfo tools 3.3.3
##OWNER= 
##DATA TYPE= NMR SPECTRUM
##DATA CLASS= XYDATA
##.OBSERVE FREQUENCY= 100
##.OBSERVE NUCLEUS= ^1H
##$DECIM= 0
##$DSPFVS= 0
##$FCOR= 0
##$SW_h= 0
##$SW= 0
##$TD= 0
##$GRPDLY= 0
##$BF1= 0
##$SFO1= 0
##$NUC1= <1H>
##.SOLVENT NAME= none
##XUNITS=	PPM
##YUNITS=	Intensity
##NPOINTS=	262144
##FIRSTX=	0
##LASTX=	11
##FIRSTY=	0
##LASTY=	0
##XFACTOR= 0.000041961829993553135
##YFACTOR= 2000
##MAXY= 3153301768.974429
##MINY= 0
##DELTAX= 0.000041961829993553135
##XYDATA=(X++(Y..Y))
0@%S9734J%T0J%sJ%WJ%VJ%UJ%UJ%TJ%J%TJ%J%JT%JT%JU%JXKJUKJKJKTJKVLKTLKLWMLMWNMNTONOVPUQURVJ0J1J0J2J1J2
19870C03J3TJ4UJ5J6J7J6J8TJ9K0K1TK2K3TK5TK7TK8L0TL2L3TL6TL8L9M0M2M3M5M6M8N0N1N4N5N6N9O1O3O5O8O9P2P4
19921B120P7Q0Q2Q4Q8R0R4R6J00J03J06J09J13J17J21J24J28J32J37J40J45J50J54J59J64J69J74J80J85J90J96K03
19953F310K08K14K21K27K34K41K48K55K63K70K78K86K94L03L11L20L29L38L48L58L67L77L88L99M09M20M32M44M55M68
19983A6015M80M93N05N19N33N47N60N76N90O05O21O36O52O69O86P03P20P38P56P75P94Q13Q32Q53Q73Q93R15R37R58
20012C6247R81J004J027J051J074J100J124J149J176J201J229J255J283J311J340J369J398J428J459J489J521J553
20034F3769J585J618J652J685J720J754J790J826J862J899J936J974K013K051K091K131K171K213K253K296K338K381
20056A07008K425K469K513K558K604K650K696K743K791K839K887K936K986L036L086L136L188L240L292L345L397L452
20078A71277L505L559L614L669L725L780L837L893L951M007M066M123M182M240M298M358M418M477M537M597M657M718
$$ plain form
19870 303 316 329 343 357 371 386 402 419 435 453 471 490 510 531 552 574 597 620 645 670 697 724 752 782 812 844 877 910 946 982 1020 1059 1099 1141 1184 1229 1275 1323 1373 1424 1478 1533 1589 1648 1709 1772 1837 1905 1974 2046 2120
19921 2120 2197 2277 2359 2443 2531 2621 2715 2811 2911 3014 3120 3229 3342 3459 3580 3704 3832 3964 4101 4241 4386 4536 4690 4849 5013 5182 5356 5536 5721 5911 6107 6310
19953 6310 6518 6732 6953 7180 7414 7655 7903 8158 8421 8691 8969 9255 9549 9852 10163 10483 10812 11150 11498 11856 12223 12600 12988 13387 13796 14216 14648 15092 15547 16015
19983 16015 16495 16988 17493 18012 18545 19092 19652 20228 20818 21423 22044 22680 23332 24001 24687 25390 26110 26848 27604 28379 29173 29986 30818 31671 32544 33437 34352 35289 36247
20012 36247 37228 38232 39259 40310 41384 42484 43608 44757 45933 47134 48363 49618 50901 52212 53552 54921 56319 57747 59206 60695 62216 63769
20034 63769 65354 66972 68624 70309 72029 73783 75573 77399 79261 81160 83096 85070 87083 89134 91225 93356 95527 97740 99993 102289 104627 107008
20056 107008 109433 111902 114415 116973 119577 122227 124923 127666 130457 133296 136183 139119 142105 145141 148227 151363 154551 157791 161083 164428 167825 171277
20078 171277 174782 178341 181955 185624 189349 193129 196966 200859 204810 208817 212883 217006 221188 225428 229726 234084 238502 242979 247516 252113 256770 261488
20100B61488M778M840M900M961N023N084N146N207N268N331N392N453N515N577N638N700N761N823N883N945O005O066
20122C80784O126O187O247O306O365O425O483O541O600O657O714O770O827O882O938O992P046P099P152P204P256P306
20144E28907P356P406P454P501P548P595P639P683P727P769P811P851P890P928P965Q002Q036Q071Q103Q134Q165Q193
20166G00734Q222Q247Q273Q297Q319Q340Q359Q378Q395Q409Q424Q436Q447Q456Q464Q469Q475Q477Q478TQ476Q472
20188H85525Q466Q460Q450Q440Q428Q413Q397Q380Q360Q339Q315Q291Q263Q235Q205Q172Q138Q101Q064Q024P982P938
20210A067386P893P845P796P745P692P637P580P522P461P398P334P268P200P131P058O986O910O833O754O674O591
20231A220694O507O421O334O245O154O062N967N871N775N675N575N472N370N264N158N050M940M830M719M604M490
20252A337177M375M257M138M020L898L777L654L530L406L279L153L025K896K767K637K505K374K242K109J975J840
$$ plain form
20100 261488 266266 271106 276006 280967 285990 291074 296220 301427 306695 312026 317418 322871 328386 333963 339601 345301 351062 356885 362768 368713 374718 380784
20122 380784 386910 393097 399344 405650 412015 418440 424923 431464 438064 444721 451435 458205 465032 471914 478852 485844 492890 499989 507141 514345 521601 528907
20144 528907 536263 543669 551123 558624 566172 573767 581406 589089 596816 604585 612396 620247 628137 636065 644030 652032 660068 668139 676242 684376 692541 700734
20166 700734 708956 717203 725476 733773 742092 750432 758791 767169 775564 783973 792397 800833 809280 817736 826200 834669 843144 851621 860099 868577 877053 885525
20188 885525 893991 902451 910901 919341 927769 936182 944579 952959 961319 969658 977973 986264 994527 1002762 1010967 1019139 1027277 1035378 1043442 1051466 1059448 1067386
20210 1067386 1075279 1083124 1090920 1098665 1106357 1113994 1121574 1129096 1136557 1143955 1151289 1158557 1165757 1172888 1179946 1186932 1193842 1200675 1207429 1214103 1220694
20231 1220694 1227201 1233622 1239956 1246201 1252355 1258417 1264384 1270255 1276030 1281705 1287280 1292752 1298122 1303386 1308544 1313594 1318534 1323364 1328083 1332687 1337177
20252 1337177 1341552 1345809 1349947 1353967 1357865 1361642 1365296 1368826 1372232 1375511 1378664 1381689 1384585 1387352 1389989 1392494 1394868 1397110 1399219 1401194 1403034
20273A403034J706J571J435J299J162J026Q88P51O13M75L38J99O1p6k15l53m91o29p66r04j041j178j314j450j586
20298A404555j721j856j990k124k257k388k521k651k782k911l039l167l294l419l545l667l791l912m033m152m271
20319A341064m387m503m618m730m843m953n062n170n276n381n485n586n686n786n882n978o072o164o255o344o431
20340A226472o517o601o682o764o841o919o994p066p139p208p275p342p405p468p528p587p643p698p751p802p850
20361A074392p899p943p987q028q068q106q142q175q208q239q266q294q318q341q363q381q400q415q429q441q451
20382I01498q461q467q472q477q478Tq477q474q469q463q455q445q435q422q408q393q376q358q337q317q294q270
20404G16272q245q218q190q161q131q100q066q033p997p962p924p885p847p805p765p722p678p635p589p543p496p449
20426E42831p399p351p301p249p199p146p093p040o986o931o876o821o764o708o650o593o535o476o418o359o300o239
$$ plain form
20273 1403034 1404740 1406311 1407746 1409045 1410207 1411233 1412121 1412872 1413485 1413960 1414298 1414497 1414558 1414482 1414267 1413914 1413423 1412794 1412028 1411124 1410083 1408905 1407591 1406141 1404555
20298 1404555 1402834 1400978 1398988 1396864 1394607 1392219 1389698 1387047 1384265 1381354 1378315 1375148 1371854 1368435 1364890 1361223 1357432 1353520 1349487 1345335 1341064
20319 1341064 1336677 1332174 1327556 1322826 1317983 1313030 1307968 1302798 1297522 1292141 1286656 1281070 1275384 1269598 1263716 1257738 1251666 1245502 1239247 1232903 1226472
20340 1226472 1219955 1213354 1206672 1199908 1193067 1186148 1179154 1172088 1164949 1157741 1150466 1143124 1135719 1128251 1120723 1113136 1105493 1097795 1090044 1082242 1074392
20361 1074392 1066493 1058550 1050563 1042535 1034467 1026361 1018219 1010044 1001836 993597 985331 977037 968719 960378 952015 943634 935234 926819 918390 909949 901498
20382 901498 893037 884570 876098 867621 859143 850665 842188 833714 825245 816782 808327 799882 791447 783025 774617 766224 757848 749490 741153 732836 724542 716272
20404 716272 708027 699809 691619 683458 675327 667227 659161 651128 643131 635169 627245 619360 611513 603708 595943 588221 580543 572908 565319 557776 550280 542831
20426 542831 535432 528081 520780 513531 506332 499186 492093 485053 478067 471136 464260 457439 450675 443967 437317 430724 424189 417713 411295 404936 398636 392397
20448C92397o180o120o059n998n938n877n815n754n693n632n569n509n446n385n323n262n200n139n077n016m954m894
20470B70557m832m772m711m650m591m530m470m411m351m292m234m175m116m059m001l944l887l831l774l718l663l608
20492A77937l553l499l445l392l339l286l234l182l131l080l030k980k931k882k833k785k738k691k645k599k553k508
20514A11621k464k419k377k333k291k249k208k166k127k086k047k008j970j932j895j858j822j785j751j716j681j648
20536F6788j614j582j549j517j486j455j425j395j365j337j308j280j252j226j198j173j146j122j096j072j048j024
20558C8118j001r79r56r34r12q92q70q51q30q11p91p73p54p36p18p01o84o67o51o34o19o04n88n73n60n45n31n17n05
20587A6931m91m79m66m54m42m31m19m08l97l87l76l66l57l46l37l28l19l11l01k93k86k77k69k62k54k47k40k34k26
20616F928k20k14k08k01j96j89j85j79j73j69j63j58j54j49j45j40j36j32j27j24j20j17j12j09j06j03r9r6r3r0q7q5
$$ plain form
20448 392397 386217 380097 374038 368040 362102 356225 350410 344656 338963 333331 327762 322253 316807 311422 306099 300837 295637 290498 285421 280405 275451 270557
20470 270557 265725 260953 256242 251592 247001 242471 238001 233590 229239 224947 220713 216538 212422 208363 204362 200418 196531 192700 188926 185208 181545 177937
20492 177937 174384 170885 167440 164048 160709 157423 154189 151007 147876 144796 141766 138786 135855 132973 130140 127355 124617 121926 119281 116682 114129 111621
20514 111621 109157 106738 104361 102028 99737 97488 95280 93114 90987 88901 86854 84846 82876 80944 79049 77191 75369 73584 71833 70117 68436 66788
20536 66788 65174 63592 62043 60526 59040 57585 56160 54765 53400 52063 50755 49475 48223 46997 45799 44626 43480 42358 41262 40190 39142 38118
20558 38118 37117 36138 35182 34248 33336 32444 31574 30723 29893 29082 28291 27518 26764 26028 25310 24609 23925 23258 22607 21973 21354 20750 20162 19589 19029 18484 17953 17436 16931
20587 16931 16440 15961 15495 15041 14599 14168 13749 13341 12944 12557 12181 11815 11458 11112 10775 10447 10128 9817 9516 9223 8937 8660 8391 8129 7875 7628 7388 7154 6928
20616 6928 6708 6494 6286 6085 5889 5700 5515 5336 5163 4994 4831 4673 4519 4370 4225 4085 3949 3817 3690 3566 3446 3329 3217 3108 3002 2899 2800 2704 2611 2521 2434 2349
20648B349q1p9p7p4p2o9o7o5o3o0n9n7n5n3n1m9m8m6m5m3m2m0l9l7Tl4Tl3l1Tk9k8k7Tk5k4Tk3k2k1k0Tj9j8j7Uj5Uj4T
$$ plain form
20648 2349 2268 2189 2112 2038 1966 1897 1830 1765 1702 1642 1583 1526 1471 1418 1367 1318 1270 1224 1179 1136 1094 1054 1015 978 941 907 873 840 809 778 749 721 694 667 642 618 594 571 549 528 508 488 469 451 434 417 400 385 370 355 341 327
20700C27j3j2Uj1Tj0Trj0qrqTpqpopoUnWmnmUlmlYkTlkXjkTjTkjTkjY%jU%jT%jT%j%j%Tj%j%Tj%Uj%Uj%Vj%Wj%sj%T0j
20838@%V67J%T0J%ZJ%XJ%VJ%UJ%UJ%J%TJ%J%J%J%J%JT%JS3KJKJKTJKWLKTLTKLTMLTMXNWOUPOPTQVRTJ0UJ1UJ2J3UJ4J5U
21447C97J7UJ8J9K0TK2UK4K5TK6K8TL0TL2TL4L6TL8L9M0M2M4M5M6M9N0N1N4N5N8N9O1O4O5O8P0P3P5P7Q1Q2Q6Q9R1R4
21498B723R8J01J04J07J11J15J18J22J26J30J35J38J43J47J53J56J62J67J72J77J83J88J94K00K06K13K18K26K32K39
21528G504K46K53K61K68K77K84K93L01L10L19L28L37L47L56L67L77L88L98M09M21M32M45M56M68M82M94N08N21N35N49
21558A8934N64N78N94O09O25O42O57O75O91P10P27P46P64P83Q03Q23Q42Q64Q84R07R27R51R73R96J020J044J068J093
21586D1494J119J145J171J198J225J253J281J310J339J369J400J430J461J494J525J559J591J626J660J696J730J767
21608G2843J804J840J879J916J956J995K035K075K117K158K200K243K287K330K376K420K465K512K559K606K654K703
21630A21973K751K802K851K902K953L006L057L111L164L218L273L328L383L440L496L553L611L669L728L787L847L907
21652A94810L967M028M090M151M214M276M340M403M467M531M595M661M726M792M857M923M991N056N124N191N258N326
$$ plain form
21447 397 414 431 448 466 485 505 525 547 569 591 615 640 665 691 719 747 777 807 839 871 905 941 977 1015 1054 1094 1136 1180 1225 1271 1320 1370 1421 1475 1530 1588 1647 1708 1772 1837 1905 1975 2048 2123 2200 2281 2363 2449 2538 2629 2723
21498 2723 2821 2922 3026 3133 3244 3359 3477 3599 3725 3855 3990 4128 4271 4418 4571 4727 4889 5056 5228 5405 5588 5776 5970 6170 6376 6589 6807 7033 7265 7504
21528 7504 7750 8003 8264 8532 8809 9093 9386 9687 9997 10316 10644 10981 11328 11684 12051 12428 12816 13214 13623 14044 14476 14921 15377 15845 16327 16821 17329 17850 18385 18934
21558 18934 19498 20076 20670 21279 21904 22546 23203 23878 24569 25279 26006 26752 27516 28299 29102 29925 30767 31631 32515 33422 34349 35300 36273 37269 38289 39333 40401 41494
21586 41494 42613 43758 44929 46127 47352 48605 49886 51196 52535 53904 55304 56734 58195 59689 61214 62773 64364 65990 67650 69346 71076 72843
21608 72843 74647 76487 78366 80282 82238 84233 86268 88343 90460 92618 94818 97061 99348 101678 104054 106474 108939 111451 114010 116616 119270 121973
21630 121973 124724 127526 130377 133279 136232 139238 142295 145406 148570 151788 155061 158389 161772 165212 168708 172261 175872 179541 183269 187056 190903 194810
21652 194810 198777 202805 206895 211046 215260 219536 223876 228279 232746 237277 241872 246533 251259 256051 260908 265831 270822 275878 281002 286193 291451 296777
21674B96777N394N462N530N598N667N735N804N872N941O010O079O147O215O285O353O421O490O557O626O694O761O828
21696D31246O896O962P029P094P161P226P291P356P420P483P546P609P671P733P793P853P913P972Q029Q087Q144Q199
21718E97713Q254Q308Q361Q413Q465Q514Q564Q613Q659Q705Q751Q794Q837Q878Q918Q958Q995R031R067R100R132R164
21740G90194R193R220R248R272R295R318R338R356R374R389R402R415R425R434R440R445R449R450R449R447R443R437
21762I96433R429R418R407R394R377R359R340R318R294R269R240R211R179R144R109R070R030Q988Q943Q896Q848Q798
21784A198494Q744Q690Q632Q573Q512Q449Q383Q316Q246Q175Q101Q025P947P868P786P701P616P529P438P347P252
21805A367824P158P059O961O859O756O651O544O436O326O213O100N985N867N749N629N507N383N259N132N005M875
21826A495278M745M613M480M345M210M073L934L796L655L514L372L228L084K939K793K646K498K350K202K051J902
$$ plain form
21674 296777 302171 307633 313163 318761 324428 330163 335967 341839 347780 353790 359869 366016 372231 378516 384869 391290 397780 404337 410963 417657 424418 431246
21696 431246 438142 445104 452133 459227 466388 473614 480905 488261 495681 503164 510710 518319 525990 533723 541516 549369 557282 565254 573283 581370 589514 597713
21718 597713 605967 614275 622636 631049 639514 648028 656592 665205 673864 682569 691320 700114 708951 717829 726747 735705 744700 753731 762798 771898 781030 790194
21740 790194 799387 808607 817855 827127 836422 845740 855078 864434 873808 883197 892599 902014 911439 920873 930313 939758 949207 958657 968106 977553 986996 996433
21762 996433 1005862 1015280 1024687 1034081 1043458 1052817 1062157 1071475 1080769 1090038 1099278 1108489 1117668 1126812 1135921 1144991 1154021 1163009 1171952 1180848 1189696 1198494
21784 1198494 1207238 1215928 1224560 1233133 1241645 1250094 1258477 1266793 1275039 1283214 1291315 1299340 1307287 1315155 1322941 1330642 1338258 1345787 1353225 1360572 1367824
21805 1367824 1374982 1382041 1389002 1395861 1402617 1409268 1415812 1422248 1428574 1434787 1440887 1446872 1452739 1458488 1464117 1469624 1475007 1480266 1485398 1490403 1495278
21826 1495278 1500023 1504636 1509116 1513461 1517671 1521744 1525678 1529474 1533129 1536643 1540015 1543243 1546327 1549266 1552059 1554705 1557203 1559553 1561755 1563806 1565708
21847A565708J750J600J447J296J143R90Q37O83N30L76K23O8q6k39l94n47p01q54j007j161j312j465j616j768j919
21872A563582k068k218k367k515k663k809k956l100l244l388l530l671l811l951m088m225m360m495m628m760m890
21893A489845n019n147n273n397n521n642n762n881n998o112o227o338o448o556o663o768o871o971p071p168p264
21914A359748p357p449p538p625p712p795p876p957q033q110q183q254q323q391q456q519q580q639q696q750q803
21935A188702q854q902q948q993r034r075r113r148r183r214r243r272r297r320r343r361r380r394r409r420r430
21956I95369r437r444r447r450r449Tr444r440r433r424r413r401r387r372r355r335r315r294r269r244r218r190
21978G89159r159r129r097r062r028q991q953q914q873q832q790q745q700q655q606q559q509q459q407q355q302q248
22000E96786q193q137q081q023p965p906p846p787p725p664p602p540p476p412p349p284p218p154p087p021o955o888
$$ plain form
21847 1565708 1567458 1569058 1570505 1571801 1572944 1573934 1574771 1575454 1575984 1576360 1576583 1576651 1576565 1576326 1575932 1575385 1574684 1573830 1572823 1571662 1570350 1568885 1567269 1565501 1563582
21872 1563582 1561514 1559296 1556929 1554414 1551751 1548942 1545986 1542886 1539642 1536254 1532724 1529053 1525242 1521291 1517203 1512978 1508618 1504123 1499495 1494735 1489845
21893 1489845 1484826 1479679 1474406 1469009 1463488 1457846 1452084 1446203 1440205 1434093 1427866 1421528 1415080 1408524 1401861 1395093 1388222 1381251 1374180 1367012 1359748
21914 1359748 1352391 1344942 1337404 1329779 1322067 1314272 1306396 1298439 1290406 1282296 1274113 1265859 1257536 1249145 1240689 1232170 1223590 1214951 1206255 1197505 1188702
21935 1188702 1179848 1170946 1161998 1153005 1143971 1134896 1125783 1116635 1107452 1098238 1088995 1079723 1070426 1061106 1051763 1042402 1033022 1023628 1014219 1004799 995369
21956 995369 985932 976488 967041 957591 948142 938693 929249 919809 910376 900952 891539 882138 872751 863379 854024 844689 835374 826080 816811 807567 798349 789159
21978 789159 780000 770871 761774 752712 743684 734693 725740 716826 707953 699121 690331 681586 672886 664231 655625 647066 638557 630098 621691 613336 605034 596786
22000 596786 588593 580456 572375 564352 556387 548481 540635 532848 525123 517459 509857 502317 494841 487429 480080 472796 465578 458424 451337 444316 437361 430473
22022D30473o821o753o686o618o550o482o414o345o277o208o139o071o002n933n865n796n727n659n591n522n454n386
22044B96174n319n250n184n116n049m983m916m850m784m719m653m588m524m460m396m332m269m207m145m082m021l961
22066A94366l900l840l780l721l663l604l547l490l433l377l322l266l212l158l105l052k999k948k896k846k795k746
22088A21666k697k649k601k553k507k460k415k370k326k282k238k196k153k112k071k030j991j951j912j874j836j800
22110G2642j763j726j692j656j622j588j554j522j490j458j427j395j366j336j307j278j250j222j195j168j141j116
22132D1370j091j065j041j018r93r71r47r26r03q82q62q40q21q00p81p62p44p25p07o90o73o56o39o23o08n92n76n62
22160A8872n48n34n19n06m93m80m67m55m43m31m19m08l98l86l76l65l56l46l36l27l17l09l01k91k84k75k68k60k52
22189G722k46k38k31k25k18k11k06j99j94j87j82j77j71j66j62j56j51j47j43j38j33j30j26j21j18j14j11j07j04j00
$$ plain form
22022 430473 423652 416899 410213 403595 397045 390563 384149 377804 371527 365319 359180 353109 347107 341174 335309 329513 323786 318127 312536 307014 301560 296174
22044 296174 290855 285605 280421 275305 270256 265273 260357 255507 250723 246004 241351 236763 232239 227779 223383 219051 214782 210575 206430 202348 198327 194366
22066 194366 190466 186626 182846 179125 175462 171858 168311 164821 161388 158011 154689 151423 148211 145053 141948 138896 135897 132949 130053 127207 124412 121666
22088 121666 118969 116320 113719 111166 108659 106199 103784 101414 99088 96806 94568 92372 90219 88107 86036 84006 82015 80064 78152 76278 74442 72642
22110 72642 70879 69153 67461 65805 64183 62595 61041 59519 58029 56571 55144 53749 52383 51047 49740 48462 47212 45990 44795 43627 42486 41370
22132 41370 40279 39214 38173 37155 36162 35191 34244 33318 32415 31533 30671 29831 29010 28210 27429 26667 25923 25198 24491 23801 23128 22472 21833 21210 20602 20010 19434 18872
22160 18872 18324 17790 17271 16765 16272 15792 15325 14870 14427 13996 13577 13169 12771 12385 12009 11644 11288 10942 10606 10279 9962 9653 9352 9061 8777 8502 8234 7974 7722
22189 7722 7476 7238 7007 6782 6564 6353 6147 5948 5754 5567 5385 5208 5037 4871 4709 4553 4402 4255 4112 3974 3841 3711 3585 3464 3346 3232 3121 3014 2910 2810
22219B810r7r4r2q8q5q3p9p8p4p3p0o7o6o3o1n9n7n5n4n1n0m8m6m5m3m2m1l9l7Tl5l3Tl1Tk9k8Tk6k5Tk3Tk2k1k0Tj9
22267D64j8j7Tj6Tj5Tj3j4j3j2Uj1j0j1rj0rTqUpqpopoTnonUmnmVlmlWklklkYjkjkjkjVkjT%jW%jT%j%j%j%j%j%j%Tj%U
$$ plain form
22219 2810 2713 2619 2527 2439 2354 2271 2192 2114 2040 1967 1897 1830 1764 1701 1640 1581 1524 1469 1415 1364 1314 1266 1220 1175 1132 1090 1049 1010 973 936 901 868 835 804 773 744 716 688 662 637 612 589 566 544 523 503 483 464
22267 464 446 429 412 396 380 365 350 337 323 310 298 286 274 263 253 242 233 223 214 205 197 189 181 174 166 159 153 146 140 134 129 123 118 113 108 104 99 95 91 87 83 80 76 73 70 67 64 61 59 56 54 51 49 47 45 43 41 39 37 36 34 33 31 30 28 27 26 25 24 22 21 20 20 19 18 17 16 15 15 14 13 13 12 12 11 11 10 10 9 9 8 8 7 7 7 6 6 6 6
22366Fj%Uj%Vj%Wj%sj%T0j%X548J%T7J%S3J%sJ%XJ%WJ%VJ%UJ%UJ%TJ%TJ%TJ%TJ%J%TJ%J%J%J%JT%J%JT%JU%JV%JS1KJV
29097D7KJTKJKJKJKJKUJKS1LKTLKLKLTKLsMLMLMLMLMYNMTNMNTMNWONTONOTNOWPOPOPOPYQPQPQZRQRQRZJ0RJ0RJ0TRJ0W
29232G40J1J0TJ1J0J1J0J1UJ0J1WJ2J1UJ2J1TJ2J1J2J1J2J1J2J1J2TJ1J2TJ1J2UJ1J2TJ1J2TJ1J2TJ1J2J1J2J1J2J1J2
29289A385J1UJ2J1XJ0J1TJ0J1J0UJ1J0TRJ0TRJ0RYQRQVPQPQPUOPOWNONVMNMULMLVKLKUJKJU%J%Vj%jTkjkjklklklTmlmW
29397A899nTmonTonoTpopopVqpqWrqrYj0rj0Urj1j0Uj1j0j1j0j1Uj0j1Tj2j1Vj2j1j2j1Tj2Tj1j2j1j2Tj1j2Tj1j2Tj1
29475A175j2Uj1j2Tj1j2j1j2Tj1j2j1j2j1Tj2j1Tj2j1Zj0j1Tj0j1j0j1j0Tj1j0Xrj0rj0rj0rZqrqrqYpqTpTqpWopTopos
$$ plain form
29232 740 751 761 771 782 792 803 813 824 835 846 856 867 878 889 900 911 923 934 945 956 968 979 990 1002 1013 1025 1036 1048 1059 1071 1082 1094 1106 1117 1129 1141 1152 1164 1176 1188 1199 1211 1223 1234 1246 1258 1269 1281 1293 1304 1316 1327 1339 1350 1362 1373 1385
29289 1385 1396 1407 1418 1430 1441 1452 1463 1474 1485 1496 1506 1517 1528 1538 1549 1559 1569 1579 1590 1600 1610 1619 1629 1639 1648 1658 1667 1676 1685 1694 1703 1712 1721 1729 1738 1746 1754 1762 1770 1777 1785 1792 1800 1807 1814 1821 1827 1834 1840 1846 1852 1858 1864 1869 1875 1880 1885 1890 1895 1899 1904 1908 1912 1916 1919 1923 1926 1929 1932 1935 1937 1940 1942 1944 1946 1947 1949 1950 1951 1952 1952 1953 1953 1953 1953 1953 1952 1952 1951 1950 1948 1947 1945 1944 1942 1939 1937 1934 1932 1929 1926 1922 1919 1915 1911 1907 1903 1899
29397 1899 1894 1889 1885 1879 1874 1869 1863 1858 1852 1846 1839 1833 1826 1820 1813 1806 1799 1792 1784 1777 1769 1761 1753 1745 1737 1728 1720 1711 1702 1693 1684 1675 1666 1657 1647 1638 1628 1618 1608 1599 1588 1578 1568 1558 1547 1537 1526 1516 1505 1494 1483 1473 1462 1451 1439 1428 1417 1406 1395 1383 1372 1360 1349 1338 1326 1314 1303 1291 1280 1268 1256 1245 1233 1221 1210 1198 1186 1175
29475 1175 1163 1151 1139 1128 1116 1104 1093 1081 1070 1058 1046 1035 1023 1012 1000 989 978 966 955 944 932 921 910 899 888 877 866 855 844 834 823 812 802 791 781 770 760 750 739 729 719 709 699 689 679 670 660 651 641 632 622 613 604 595 586 577 568 559 550 542 533 525 516 508 500 492 484 476 468 460 453 445 437 430 423 415 408 401 394 387 380 374 367 360 354 347 341 335 329 323 317 311 305 299 293
29570B93nononZmnTmTnmslmlmlmlS1klklklklkS3jkTjkTjkjTkjTkjUkjS3%jU%jU%jT%j%jT%j%j%j%j%Tj%j%Tj%Tj%Tj%T
29706Ij%Uj%Uj%Vj%Wj%Xj%sj%S3j%T7j%Y06J%T5J%S1J%ZJ%WJ%VJ%VJ%TJ%UJ%TJ%J%TJ%J%J%J%J%JT%JT%JT%JS4KJTKJT
30608D4KJKTJKUJKULKULKLKLTKLVMLTMLMYNMNTMNONTOTNOTPOPOPTQPQPQTRQRVJ0TRJ1J0J1VJ2J1J2J3J2J3TJ4TJ3J5J4
30700F11J5TJ6J5J6J7J6J7J8J7J8J9J8J9K0VK1TK2UK3UK4K5K4K5K6UK7TK8TK9UL0L1UL2TL3TL4UL6L5L6L7TL8UL9M0T
30762B246M1UM2M3TM4TM5TM6UM8M7M9M8N0M9N1N0N2N1N3N2N4N3N5N4N5N6TN7UN8N9N8O0N9O0O1UO2TO3UO4UO5UO6UO7V
30824E670O8VO9WP0O9P0ZP1P0TP1P0ZO9P0O9UO8TO9O7O8O7UO6TO5O6O4O5O4O3UO2O1TO0UN8UN7N6TN5N4N3TN2TN0TM9
30899A0535M8TM6TM5M4M3TM1TL9TL8L7L5TL4L3L2L1L0K9K8K7K6K5K3TK2K0TJ8TJ6J5J4J3J2J1J0QTOTMLKJ%kTmTopqr
30956A1729j0j1j2j4Tj5j7Tj9Tk1Tk3k4Tk6Tk8Tl0Tl1l2l3l4l5l6Tl7l9Um1Tm2m3m4Tm5m6Tm7Tm9Un0n1Un3n2n3n4Un5
31013I698n6n5n6n7n6n7n8n7n8Tn9n8n9Wo0n9o0Tn9o0Un9o0Tn9o0n9To0n9Tn8n9n8Un7n8n7Tn6Vn5Tn4Un3Un2n1n2n0U
31075F166m9Tm8Tm7Tm6Tm5Tm3m4m3m2Tm1m0Tl9Tl8Tl7l6Tl5l4Tl3Tl2l1Tl0k9Tk8Tk7k6Tk5Tk4k3Tk2Tk1k0Tj9Tj8j7U
$$ plain form
30608 44 46 47 49 51 52 54 56 58 59 61 63 65 68 70 72 74 77 79 82 84 87 90 92 95 98 101 104 108 111 114 118 121 125 129 133 137 141 145 149 154 158 163 168 172 177 183 188 193 199 205 210 216 222 229 235 242 248 255 262 270 277 285 292 300 308 317 325 334 343 352 361 371 381 390 401 411 422 433 444 455 467 478 490 503 515 528 541 555 569 582 597 611
30700 611 626 641 657 672 688 705 721 738 756 773 791 810 828 847 867 887 907 927 948 969 991 1013 1035 1058 1081 1104 1128 1153 1177 1202 1228 1254 1280 1307 1334 1362 1390 1419 1448 1477 1507 1538 1569 1600 1632 1664 1697 1730 1764 1798 1832 1868 1903 1939 1976 2013 2051 2089 2127 2166 2206 2246
30762 2246 2287 2328 2369 2411 2454 2497 2541 2585 2630 2675 2721 2767 2813 2861 2908 2957 3005 3055 3104 3155 3205 3257 3308 3361 3413 3467 3520 3575 3629 3684 3740 3796 3853 3910 3967 4025 4084 4142 4202 4261 4321 4382 4443 4504 4566 4628 4691 4754 4817 4881 4945 5009 5074 5139 5204 5270 5336 5402 5469 5536 5603 5670
30824 5670 5738 5806 5874 5942 6011 6080 6149 6218 6287 6357 6426 6496 6566 6636 6706 6776 6846 6916 6986 7057 7127 7197 7268 7338 7408 7478 7548 7618 7688 7758 7828 7897 7967 8036 8105 8174 8242 8310 8379 8446 8514 8581 8648 8715 8781 8847 8912 8978 9042 9107 9171 9234 9297 9360 9422 9483 9544 9604 9664 9724 9782 9840 9898 9955 10011 10067 10122 10176 10229 10282 10334 10386 10436 10486 10535
30899 10535 10583 10631 10677 10723 10768 10812 10855 10898 10939 10980 11019 11058 11096 11133 11168 11203 11237 11270 11302 11333 11363 11392 11420 11447 11473 11498 11521 11544 11566 11586 11606 11624 11642 11658 11673 11687 11700 11712 11723 11733 11741 11749 11755 11761 11765 11768 11770 11771 11771 11769 11767 11763 11759 11753 11746 11738 11729
30956 11729 11719 11708 11696 11682 11668 11653 11636 11619 11600 11581 11560 11539 11516 11492 11468 11442 11416 11388 11360 11330 11300 11269 11237 11204 11170 11135 11099 11063 11026 10987 10948 10909 10868 10827 10785 10742 10698 10654 10609 10563 10517 10470 10423 10374 10325 10276 10226 10175 10124 10073 10020 9968 9915 9861 9807 9753 9698
31013 9698 9642 9587 9531 9474 9418 9361 9303 9246 9188 9130 9071 9013 8954 8895 8836 8777 8718 8658 8599 8539 8479 8420 8360 8300 8240 8181 8121 8061 8002 7942 7883 7824 7764 7705 7646 7588 7529 7471 7413 7355 7298 7240 7183 7126 7070 7014 6958 6902 6847 6792 6738 6684 6630 6577 6524 6471 6419 6368 6316 6266 6216 6166
31075 6166 6117 6068 6020 5972 5925 5878 5832 5786 5741 5696 5653 5609 5566 5524 5482 5441 5401 5361 5322 5283 5245 5207 5170 5134 5098 5063 5029 4995 4962 4929 4897 4866 4835 4805 4776 4747 4719 4691 4664 4638 4612 4587 4562 4538 4515 4492 4470 4448 4427 4407 4387 4368 4349 4331 4314 4297 4280
31132D280j6j5Tj4Tj3j2j3j1Uj0TrUpqpToTnUmUlUkUjV%WJUKJKJKULKTLKLTKLWKLVKLKLKLKXJTKJU%J%VjWkVlkmlTmTn
31244D059mnTonopopUqUrVj0Uj1j0j2j1j2Vj3Tj4j3j4Tj5j4j5Tj6Wj7Vj8Vj9Tj8k0j9Tk0Vk1k0k1Vk2k1k2Xk3k2k3k2
31324B868k3Xk4k3Tk4k3Tk4k3k4Tk3k4k3k4Tk3k4k3k4k3k4k3k4k3k4k3Uk4k3Uk2k3Uk2k3k2Yk1k2k1k2k1Uk0k1k0k1k0V
31390A379j9k0j9Wj8j9j8Vj7j8j7Vj6j7j6Vj5j6j5Vj4Tj5j4Tj3j4j3Wj2j3j2Uj1j2j1j2j1j0j1Tj0j1j0Trj0TrXqTrqU
$$ plain form
31132 4280 4264 4249 4234 4220 4206 4193 4181 4168 4157 4146 4135 4125 4115 4106 4097 4088 4081 4073 4066 4059 4053 4047 4042 4037 4032 4028 4024 4020 4017 4014 4011 4009 4007 4005 4004 4003 4002 4001 4001 4001 4001 4001 4001 4002 4003 4004 4006 4007 4009 4010 4012 4014 4016 4019 4021 4023 4026 4028 4031 4034 4036 4039 4042 4045 4048 4051 4053 4056 4059 4062 4065 4067 4070 4072 4075 4077 4080 4082 4084 4086 4088 4090 4092 4093 4094 4096 4097 4098 4099 4099 4100 4100 4100 4100 4100 4099 4098 4097 4096 4095 4093 4091 4089 4087 4084 4082 4078 4075 4072 4068 4064 4059
31244 4059 4055 4050 4045 4039 4034 4028 4021 4015 4008 4001 3994 3986 3978 3970 3961 3952 3943 3934 3924 3914 3904 3893 3883 3871 3860 3848 3836 3824 3812 3799 3786 3772 3759 3745 3731 3716 3702 3687 3672 3656 3640 3624 3608 3592 3575 3558 3541 3524 3506 3488 3470 3452 3433 3414 3396 3376 3357 3338 3318 3298 3278 3258 3237 3217 3196 3175 3154 3133 3111 3090 3068 3046 3024 3002 2980 2958 2935 2913 2890 2868
31324 2868 2845 2822 2799 2776 2753 2730 2706 2683 2660 2636 2613 2590 2566 2543 2519 2495 2472 2448 2425 2401 2377 2354 2330 2307 2283 2260 2236 2213 2189 2166 2142 2119 2096 2073 2049 2026 2003 1980 1958 1935 1912 1889 1867 1844 1822 1800 1778 1756 1734 1712 1690 1669 1647 1626 1604 1583 1562 1541 1521 1500 1480 1459 1439 1419 1399 1379
31390 1379 1360 1340 1321 1302 1283 1264 1245 1227 1208 1190 1172 1154 1136 1119 1101 1084 1067 1050 1033 1017 1000 984 968 952 936 921 905 890 875 860 845 831 817 802 788 774 761 747 734 721 708 695 682 670 657 645 633 621 610 598 587 575 564 554 543 532 522 511 501 491 482 472 462 453 444 435 426 417 408 400 392 383 375 367 359
31465C59pqpqpVopopoVnoTnTonVmnTmTnmXlmlmlmlZklklklkTlksjkTjkjkjkjkjUkjS5%jU%jT%j%jT%j%j%j%j%j%Tj%Tj
31593A0%Tj%Tj%Tj%Uj%Vj%Wj%Xj%Zj%S2j%T6j%U70J%T4J%S0J%YJ%WJ%VJ%UJ%UJ%TJ%TJ%J%TJ%J%J%JT%J%JU%JW%JVKJV
32147C5KJTKJKTJKTJKWLKTLKLKLYMLMTLMTNMTNYOXPVQPQURQRJ0RJ0VJ1UJ2UJ3VJ4TJ5UJ6UJ7TJ8TJ9J8K0UK1TK2TK3T
32251I03K4TK5K6UK7K8TK9L0TL1L2TL3TL4L5L6TL7L8L9TM0M1M2TM3M5M4M6M7M8TM9N0N2TN3N4TN6N7N8N9O0TO2O3O4O5
32304C135O6O7O8P0TP1P3P4P5P6P7P8P9Q1Q2Q3Q4Q6TQ8Q9R0R2R3R4R5R6R8R9J00J02TJ04J06TJ08J09J11TJ13J15TJ17
32347G034J18J19J21J22J23J24J26J27J28J30TJ32J33J34J36J37J38J39J40J41J43J44J45J46J47J48J49J51TJ52J54T
32379A1416J56TJ58TJ59J60J61J62J63TJ65TJ66TJ68UJ69J70J71UJ72J73UJ74TJ75J74J75TJ76TJ75J76YJ75J76J75U
32426A9403J74UJ73TJ72TJ71TJ70J69TJ68J67J66J65J64TJ62TJ60J59J58J57J56J55J53J52J50J49J48J46J45J43J41
32461B5055J40J38J37J35J33J31J30J28J25J24J22J20J18J16J14J11J10J08J05J03J01R8R7R4R2Q9Q7Q5Q2Q0P7P5P2P0
32495B8702O7O5O3N9N8N4N2N0M7M4M1L9L7L3L1K9K5K4K0J8J5J2J0QMKjloqj1j4j6j8k2k3k7k8l1l4l6l8m1m3m6m8n0n2
$$ plain form
32147 35 37 38 39 41 42 44 46 47 49 51 52 54 56 58 60 62 65 67 69 72 74 77 79 82 85 88 91 94 97 100 104 107 111 115 118 122 126 131 135 139 144 149 154 159 164 169 174 180 186 192 198 204 210 217 224 231 238 246 253 261 269 277 286 294 303 313 322 332 342 352 362 373 384 395 407 419 431 444 457 470 483 497 511 526 541 556 572 588 604 621 638 656 674 693 711 731 751 771 792 813 835 857 880 903
32251 903 927 951 976 1002 1028 1054 1081 1109 1137 1166 1196 1226 1257 1289 1321 1354 1387 1421 1456 1492 1528 1565 1603 1642 1681 1721 1762 1804 1846 1889 1934 1978 2024 2071 2119 2167 2216 2266 2318 2370 2423 2477 2531 2587 2644 2702 2761 2821 2881 2943 3006 3070 3135
32304 3135 3201 3268 3336 3406 3476 3547 3620 3694 3769 3845 3922 4000 4079 4160 4242 4325 4409 4495 4581 4669 4758 4848 4940 5033 5127 5222 5318 5416 5515 5615 5717 5819 5923 6029 6135 6243 6352 6463 6574 6687 6802 6917 7034
32347 7034 7152 7271 7392 7514 7637 7761 7887 8014 8142 8272 8402 8534 8667 8801 8937 9074 9212 9351 9491 9632 9775 9919 10064 10210 10357 10505 10654 10805 10956 11108 11262 11416
32379 11416 11572 11728 11886 12044 12203 12363 12524 12686 12849 13012 13177 13342 13508 13674 13842 14010 14178 14347 14517 14688 14859 15030 15202 15375 15548 15721 15895 16069 16244 16418 16593 16768 16944 17120 17295 17471 17647 17823 17999 18175 18351 18527 18702 18878 19053 19228 19403
32426 19403 19577 19751 19925 20098 20271 20443 20615 20786 20957 21127 21296 21465 21633 21800 21966 22131 22295 22459 22621 22783 22943 23102 23260 23417 23573 23728 23881 24033 24183 24332 24480 24626 24771 24914 25055
32461 25055 25195 25333 25470 25605 25738 25869 25999 26127 26252 26376 26498 26618 26736 26852 26966 27077 27187 27295 27400 27503 27604 27702 27799 27893 27985 28074 28161 28246 28328 28408 28485 28560 28632 28702
32495 28702 28769 28834 28897 28956 29014 29068 29120 29170 29217 29261 29302 29341 29378 29411 29442 29471 29496 29520 29540 29558 29573 29585 29595 29603 29607 29609 29608 29605 29599 29591 29580 29566 29550 29532 29510 29487 29460 29432 29401 29367 29331 29293 29252 29209 29163 29115 29065 29013
32543B9013n5n6n9o1o4o5o7p0p1p3p6p7p9q1q2q5q6q8q9r1r3r4r5r7r9j00j01j02j03j05j06j07j08j09j10j11Tj13T
32582B5561j14j15Tj16j17Uj18Uj19Vj20j19Xj18Uj17Uj15j16j14Uj12Tj11j10j09Tj07j06j05j04j03j02j00Tr8r6T
32631B0028r4r2r1r0q8q6q5q4q1q0p9p7p5p3p1p0o8o6o4o2o1n8n7n4n3n1m9m7m4m3m1l9l7l4l3l1k8k7k4k3k0j9j6j4
32675A7549j2j1qomk%JMOQRJ2J3J6J7J9K1K3K4K7K8K9L2L3L5L7L8L9M2TM5TM8TN0N2TN4N6TN8TO0O1O2O3O4O5O6O7TO9T
32729A9396P0TP1P2TP3UP4P5P4P5TP6P5P6P5P6P5P6P5P6P5P4P5P4UP3P2UP1P0O9TO8TO6TO4TO3O2O1N9TN7TN5N3TN1N0
32783B3113M8TM5M4M3M1M0L8L7L5L3L1L0K9K6K5K3K1K0J7J6J4J2J0QPML%jloprj1j4j5j7j9k1k4k5k7l0l1l3l5l8l9m1
32833B3415m4m5m7m9n1n3n5n7n9o1o2o5o6o8p0p2p3p6p7p9q0q2q4q6q7q9r0r2r4r5r6r9Tj01j02j04j05j06j08j09j10
32874B0168j12Tj14j15j16j17j18j19j20j21j22j23Tj25Tj26j27j28Tj29Tj30j31Tj32Uj33Tj34Uj35j34j35Tj36j35T
$$ plain form
32543 29013 28958 28902 28843 28782 28718 28653 28586 28516 28445 28372 28296 28219 28140 28059 27977 27892 27806 27718 27629 27538 27445 27351 27256 27159 27060 26960 26859 26757 26654 26549 26443 26336 26228 26119 26009 25898 25787 25674 25561
32582 25561 25447 25332 25217 25101 24984 24867 24750 24632 24514 24396 24277 24158 24039 23920 23800 23681 23562 23443 23324 23205 23086 22968 22850 22732 22615 22498 22381 22266 22150 22036 21922 21808 21696 21584 21473 21363 21254 21145 21038 20932 20827 20723 20620 20518 20418 20318 20220 20124 20028
32631 20028 19934 19842 19751 19661 19573 19487 19402 19318 19237 19157 19078 19001 18926 18853 18782 18712 18644 18578 18514 18452 18391 18333 18276 18222 18169 18118 18069 18022 17978 17935 17894 17855 17818 17784 17751 17720 17692 17665 17641 17618 17598 17579 17563 17549
32675 17549 17537 17526 17518 17512 17508 17506 17506 17507 17511 17517 17525 17534 17546 17559 17575 17592 17611 17632 17655 17679 17706 17734 17763 17795 17828 17863 17900 17938 17977 18019 18061 18106 18151 18199 18247 18297 18349 18401 18455 18511 18567 18625 18683 18743 18804 18866 18929 18993 19058 19124 19191 19258 19327 19396
32729 19396 19466 19536 19607 19679 19751 19824 19897 19970 20044 20119 20193 20268 20343 20419 20494 20570 20645 20721 20796 20872 20947 21023 21098 21172 21247 21321 21395 21469 21542 21614 21686 21758 21829 21899 21968 22037 22105 22173 22239 22305 22369 22433 22496 22558 22619 22678 22737 22794 22851 22906 22959 23012 23063 23113
32783 23113 23161 23209 23254 23298 23341 23382 23422 23460 23497 23532 23565 23596 23626 23655 23681 23706 23729 23750 23770 23787 23803 23817 23829 23839 23847 23854 23858 23861 23861 23860 23857 23851 23844 23835 23824 23810 23795 23778 23759 23738 23714 23689 23662 23632 23601 23568 23533 23495 23456 23415
32833 23415 23371 23326 23279 23230 23179 23126 23071 23014 22955 22894 22832 22767 22701 22633 22563 22491 22418 22342 22265 22186 22106 22024 21940 21854 21767 21678 21588 21496 21402 21307 21211 21112 21013 20912 20810 20706 20601 20495 20387 20278 20168
32874 20168 20056 19944 19830 19715 19599 19482 19364 19245 19125 19004 18882 18759 18636 18511 18386 18260 18133 18005 17877 17748 17619 17489 17358 17227 17095 16963 16831 16698 16565 16431 16297 16163 16028 15894 15759 15624 15488 15353 15218
32913A5218j36j35j36j35Tj36j35Tj34j35j34Vj33Tj32Uj31Tj30Tj29Tj28Tj26j27j25Tj24Tj23j22j21j20Tj19j18
32953A0038j17Tj15Tj14j12Tj11j10Tj08j07j06j05Tj03j02Tj00r9r8r7r6r5r4r3r2r1r0q9q7Tq5Tq3q2q1Tp9p8p7p6
32995E952p4Tp3p2p0To8To6To4To2o1Tn9Tn7Tn5Tn3Tn2n1n0m9m8m7Tm5Tm4m3m2m1Tm0l9l8l7Tl6l5Tl3Ul1Uk9l0k8Tk7T
33052C188k6k5Uk3k4k2k3k2k1Tk0Uj9j8Vj7Tj6Uj5Uj4Uj3j4j3j2j3j2Wj1Vj0j1j0Yrj0rUj0rWqrVqrUqrVqrsj0rUj0r
33146A982j0rj0rj0S0j1j0Tj1Tj0j1Tj0j1Xj2j1Tj2j1Tj2j1j2Tj1j2Uj1j2S4j3j2Yj3j2S4j1j2Uj1j2Tj1j2j1Tj2j1T
$$ plain form
32913 15218 15082 14947 14811 14676 14541 14405 14270 14135 14001 13866 13732 13598 13464 13330 13197 13064 12932 12800 12668 12537 12406 12276 12146 12017 11888 11760 11632 11506 11379 11254 11129 11005 10881 10758 10636 10515 10395 10275 10156 10038
32953 10038 9921 9804 9689 9574 9460 9348 9236 9125 9015 8905 8797 8690 8584 8479 8374 8271 8169 8067 7967 7868 7770 7673 7577 7482 7388 7295 7203 7112 7022 6933 6846 6759 6674 6589 6506 6424 6343 6262 6183 6105 6028 5952
32995 5952 5878 5804 5731 5659 5589 5519 5451 5383 5317 5251 5187 5123 5061 5000 4939 4880 4821 4764 4707 4652 4597 4544 4491 4439 4388 4338 4289 4241 4194 4147 4102 4057 4013 3970 3928 3887 3846 3806 3767 3729 3692 3655 3619 3584 3549 3516 3483 3450 3419 3388 3357 3328 3298 3270 3242 3215 3188
33052 3188 3162 3137 3112 3087 3064 3040 3018 2995 2973 2952 2931 2911 2891 2871 2852 2834 2816 2798 2780 2763 2746 2730 2714 2698 2683 2668 2653 2639 2625 2611 2598 2584 2571 2559 2546 2534 2522 2510 2498 2486 2475 2464 2453 2442 2432 2421 2411 2401 2391 2381 2371 2361 2351 2342 2332 2323 2314 2305 2295 2286 2277 2268 2259 2250 2242 2233 2224 2215 2206 2198 2189 2180 2171 2163 2154 2145 2136 2127 2119 2110 2101 2092 2083 2074 2065 2056 2047 2038 2028 2019 2010 2001 1991 1982
33146 1982 1972 1963 1953 1944 1934 1924 1914 1904 1894 1884 1874 1864 1854 1844 1833 1823 1813 1802 1791 1781 1770 1759 1749 1738 1727 1716 1705 1694 1683 1671 1660 1649 1637 1626 1615 1603 1592 1580 1568 1557 1545 1533 1521 1510 1498 1486 1474 1462 1450 1438 1426 1414 1402 1390 1378 1366 1354 1342 1329 1317 1305 1293 1281 1269 1257 1245 1232 1220 1208 1196 1184 1172 1160 1148 1136 1124 1112 1100 1088 1076 1064 1053 1041 1029 1017 1006 994 982 971 959 948 937 925 914 903
33241I03j2j1Wj0j1Uj0j1j0Tj1j0Zrj0rj0rZqrqrqTrqTpqUpqpUqpTopTopopoZnononZmnTmTnmslmlmlmlS1klklklkTlkS2
33377F8jkTjkTjkjTkjTkjUkjS3%jU%jU%jT%j%jT%j%j%j%j%Tj%j%Tj%Tj%Tj%Tj%Uj%Uj%Vj%Wj%Xj%sj%S3j%U0j%V9J%T8
33608AJ%S3J%YJ%XJ%WJ%UJ%UJ%TJ%TJ%TJ%TJ%J%J%J%J%J%JT%JT%JV%JZKJVKJKJKJKJKS0LKTLTKLXMLTMZNTMNTONONOUP
33753B17OPWQVRQRJ0RJ0VJ1UJ2UJ3J2J3J4VJ5TJ6UJ7TJ8UJ9K0J9K1K0K2K1K3K2K4K3K5UK6K7TK8TK9L0TL1L2TL3L4TL6U
33826A542L8TL9M0M1TM2M3M5M4M6M7M8TN0TN2TN3N5TN7TN9TO1O2O3O4O6TO8TP0P2TP4P5P6P7P9Q0Q1Q3Q4Q6TQ9TR1R2
33877D715R4R5R7R8J00J01J03J04J05J07J09J10J12J13J15J17J18J19J22TJ25J26J28J29J31J33J34J36J37J40TJ43
33909H478J44J46J48J49J51J52J54J56J58J59J61J62J65TJ68J69J71J72J74J76J77J79J80J82J83J85J87J88J90J91
33939A3520J92J94J96J97J98K00K01K03K04K05K06K08K09K10K12K13TK15K16K18TK19K20K22TK23K24K25TK27TK28T
33972B0538K30K29K31UK32TK33UK34K33K34VK35K34UK33K34K33TK32K33K31UK30K29TK28K27K26K25TK23TK21K20K19
34014C0209K18K16K15K14K12K11K09K08K06K04K03K01J99J97J96J93J91J90J87J85J83J81J78J76J74J71J69J67J64
34043C5827J61J59J57J53J51J48J46J42J40J37J34J32J28J25J22J20J16J13J10J07J04J01R7R4R2Q7Q5Q1P9P5P1O8O5
$$ plain form
33753 217 223 230 237 244 251 258 266 274 282 290 299 307 316 326 335 345 355 365 375 386 397 408 420 432 444 457 469 482 496 510 524 538 553 568 584 600 616 633 650 668 686 704 723 743 762 783 803 825 846 869 891 915 938 963 988 1013 1039 1066 1093 1121 1149 1178 1208 1238 1269 1301 1333 1366 1400 1434 1470 1506 1542
33826 1542 1580 1618 1657 1697 1738 1779 1821 1864 1909 1953 1999 2046 2094 2142 2192 2242 2294 2346 2399 2454 2509 2566 2623 2682 2741 2802 2864 2927 2991 3057 3123 3191 3259 3329 3401 3473 3547 3622 3698 3775 3854 3934 4015 4098 4182 4268 4354 4443 4532 4623 4715
33877 4715 4809 4904 5001 5099 5199 5300 5403 5507 5612 5719 5828 5938 6050 6163 6278 6395 6513 6632 6754 6876 7001 7127 7255 7384 7515 7648 7782 7918 8055 8195 8335 8478
33909 8478 8622 8768 8916 9065 9216 9368 9522 9678 9836 9995 10156 10318 10483 10648 10816 10985 11156 11328 11502 11678 11855 12034 12214 12396 12579 12764 12951 13139 13329 13520
33939 13520 13712 13906 14102 14299 14497 14697 14898 15101 15305 15510 15716 15924 16133 16343 16555 16768 16981 17196 17412 17630 17848 18067 18287 18509 18731 18954 19178 19403 19628 19855 20082 20310 20538
33972 20538 20768 20997 21228 21459 21690 21922 22154 22387 22620 22853 23087 23320 23554 23788 24022 24256 24491 24725 24959 25193 25426 25660 25893 26126 26358 26591 26822 27053 27284 27514 27743 27972 28200 28427 28653 28878 29103 29326 29549 29770 29990 30209
34014 30209 30427 30643 30858 31072 31284 31495 31704 31912 32118 32322 32525 32726 32925 33122 33318 33511 33702 33892 34079 34264 34447 34628 34806 34982 35156 35327 35496 35663 35827
34043 35827 35988 36147 36304 36457 36608 36756 36902 37044 37184 37321 37455 37587 37715 37840 37962 38082 38198 38311 38421 38528 38632 38733 38830 38924 39016 39103 39188 39269 39348 39423 39494 39562 39627
34076C9627O2N9N5N2M8M5M2L9L5L2K9K6K2J9J5J3ROL%lprj3j6j9k1k5k8l0l3l7l9m1m5m7n0n2n5n8o0o2o5o7o9p2p4p5
34124C9066p8q0q2q4q6q7r0r1r2r4r6r7r8j00j01j02j03j04j05j07Uj09Uj10j11j10j11j12j11j12j11Wj10Tj09Tj07
34166C4771j08j06j05Tj03j02j01j00r8r7r6r4r2r1q9q7q5q3q2p9p7p4p3p0o8o5o2o0n8n4n2m9m6m4m0l7l4l1k8k4k1
34207C1801j8j4j1qmjMOJ1J4J8K1K5L0L3L7M0M5M9N2N7O1O4O9P3P6Q1Q5Q9R3R7J02J05J10J13J18J21J26J30J34J38
34248C4172J42J46J50J54J58J62J66J70J74J78J81J85J89J93J97K00K04K07K11K15K18K22K25K28K32K35K38K41K45
34277C9838K48K50K54K57K59K62K65K68K71K73K75K79K80K83K85K88K89K92K94K95K98L00L01L03L05L06L08L09L11
34306D8046L12L13L14L16L17TL19TL20L21TL22L23VL24UL25L24UL23L24L23L22L23L21UL19UL17L16TL14L13TL11L09T
34349F1771L07L06L04L03L02L00K98K97K95K93K92K90K88K87K84K83K80K79K77K75K72K71K69K67K64K63K60K58K56
$$ plain form
34076 39627 39689 39748 39803 39855 39903 39948 39990 40029 40064 40096 40125 40151 40173 40192 40207 40220 40229 40235 40238 40238 40235 40228 40219 40206 40190 40171 40150 40125 40097 40067 40034 39997 39958 39917 39872 39825 39775 39723 39668 39610 39550 39488 39423 39356 39287 39215 39141 39066
34124 39066 38988 38908 38826 38742 38656 38569 38479 38388 38296 38202 38106 38009 37911 37811 37710 37608 37505 37401 37296 37189 37082 36975 36866 36757 36648 36538 36427 36317 36206 36094 35983 35871 35760 35649 35538 35427 35316 35206 35096 34987 34878 34771
34166 34771 34663 34557 34452 34347 34244 34142 34041 33941 33843 33746 33650 33556 33464 33373 33284 33197 33112 33029 32947 32868 32791 32717 32644 32574 32506 32441 32379 32319 32261 32207 32155 32106 32060 32016 31976 31939 31905 31874 31846 31822 31801
34207 31801 31783 31769 31758 31750 31746 31745 31749 31755 31766 31780 31798 31819 31844 31874 31907 31944 31984 32029 32078 32130 32187 32248 32312 32381 32454 32530 32611 32696 32785 32878 32975 33077 33182 33292 33405 33523 33644 33770 33900 34034 34172
34248 34172 34314 34460 34610 34764 34922 35084 35250 35420 35594 35772 35953 36138 36327 36520 36717 36917 37121 37328 37539 37754 37972 38194 38419 38647 38879 39114 39352 39593 39838
34277 39838 40086 40336 40590 40847 41106 41368 41633 41901 42172 42445 42720 42999 43279 43562 43847 44135 44424 44716 45010 45305 45603 45903 46204 46507 46812 47118 47426 47735 48046
34306 48046 48358 48671 48985 49301 49618 49935 50254 50573 50893 51214 51535 51857 52180 52503 52826 53149 53473 53797 54121 54446 54770 55094 55418 55741 56065 56388 56710 57033 57354 57675 57996 58315 58634 58953 59270 59586 59902 60216 60529 60842 61153 61462 61771
34349 61771 62078 62384 62688 62991 63293 63593 63891 64188 64483 64776 65068 65358 65646 65933 66217 66500 66780 67059 67336 67611 67883 68154 68423 68690 68954 69217 69477 69735 69991
34378F9991K54K52K50K47K45K43K41K39K36K34K32K30K28K25K23K21K19K17K14K13K10K08K06K04K02J99J98J95J94
34407G6470J92J89J88J85J84J82J80J78J76J74J73J71J69J67J66J64J62J61J59J58J56J54J53J52J50J48TJ46J44TJ42
34438H1585J40TJ38J37J36J35J33TJ31TJ29TJ27J26TJ24TJ22TJ21J20J19J18TJ16TJ15J14TJ12TJ11TJ09TJ08J07J06T
34477H6330J05J04J03TJ01TJ00R9R8TR6TR5R3TR2R1R0Q9Q7TQ6Q4Q3Q2Q1Q0P8P7P6P4P3P1P0O9O6TO4O2O0N9N6TN3N1N0
34523I0078M7M5M4M1L9L8L4L3L0K8K6K3K1J8J6J3J1POK%lorj2j4j8k1k4k6l0l4l6l9m3m6n0n2n6o0o3o6p0p3p7q0q4q8
34571H9420r1r4r9j01j06j09j13j16j21j23j28j31j35j39j42j46j50j54j57j61j64j68j72j76j79j83j87j90j93j98
34601H5094k01k04k08k12k14k19k22k25k29k32k35k39k41k46k48k51k55k58k61k63k67k70k73k75k79k81k84k87k89
34630G7926k92k94k97l00l02l04l07l09l11l14l15l18l20l21l24l26l27l29l31l33l34l36l37l39l41Tl44Tl45l47l48
$$ plain form
34378 69991 70245 70497 70747 70994 71239 71482 71723 71962 72198 72432 72664 72894 73122 73347 73570 73791 74010 74227 74441 74654 74864 75072 75278 75482 75684 75883 76081 76276 76470
34407 76470 76662 76851 77039 77224 77408 77590 77770 77948 78124 78298 78471 78642 78811 78978 79144 79308 79470 79631 79790 79948 80104 80258 80411 80563 80713 80861 81009 81155 81299 81443 81585
34438 81585 81725 81865 82003 82140 82276 82411 82544 82677 82808 82939 83068 83197 83324 83450 83576 83700 83824 83946 84068 84189 84309 84428 84546 84664 84780 84896 85011 85125 85239 85351 85463 85574 85685 85794 85903 86011 86118 86224 86330
34477 86330 86435 86539 86642 86745 86846 86947 87047 87146 87244 87342 87438 87534 87629 87722 87815 87907 87998 88088 88177 88264 88351 88437 88521 88604 88686 88767 88847 88925 89002 89078 89152 89225 89296 89366 89435 89501 89567 89631 89693 89753 89812 89868 89924 89977 90028 90078
34523 90078 90125 90170 90214 90255 90294 90332 90366 90399 90429 90457 90483 90506 90527 90545 90561 90574 90585 90592 90598 90600 90600 90597 90591 90582 90570 90556 90538 90517 90493 90467 90437 90403 90367 90328 90285 90239 90189 90137 90081 90021 89958 89892 89822 89749 89672 89592 89508 89420
34571 89420 89329 89235 89136 89035 88929 88820 88707 88591 88470 88347 88219 88088 87953 87814 87672 87526 87376 87222 87065 86904 86740 86572 86400 86224 86045 85862 85675 85485 85292 85094
34601 85094 84893 84689 84481 84269 84055 83836 83614 83389 83160 82928 82693 82454 82213 81967 81719 81468 81213 80955 80694 80431 80164 79894 79621 79346 79067 78786 78502 78215 77926
34630 77926 77634 77340 77043 76743 76441 76137 75830 75521 75210 74896 74581 74263 73943 73622 73298 72972 72645 72316 71985 71652 71318 70982 70645 70306 69965 69624 69280 68936 68591 68244 67896
34661F7896l49l50l51l52l53Tl55Tl56Tl57l58Ul59Tl60Tl59l61l60Ul61l60Wl59Vl58l57Ul56Tl55l54l53Ul51Tl49T
34709E0791l48Tl46l45Tl43Tl41l40Tl38l37l36l35l33Tl31l30l29l28l26l25l24l22Tl20l18l17l16l15l13l12l11
34742C9881l09l08l06l05l04l02l01k99k98k97k95k94k92k91k90k88k87k85k84k82k81k80k78k77k76k74k72k71k70
34771C1485k69k66Tk64k63k62k60k58Tk56k54k53k52k51k49k48k46k45k44k42Tk39Tk37k36k34Tk32k30Tk28k26Tk24
34805B3122k23k22k20k19k18k17k15k14k13k12k10k09k08k07k05k04k03k02k01j99j98j97j95Tj93j92j91j89Tj87j86
34836A6789j84Tj82j81j80j79j78j76j75j74j73j71j70Tj68j66Tj64j63j62j61j60j58j57j56j55j54j52j51j50j49
34867A1620j48j46j45j44j43j42j40Tj38j37j36j34j33Tj31j30j28Tj26j25j24j23j21Tj19j18j17j16j14Tj12j11j10
34900G373j09j07Tj05j04j03j02j01r9Tr7r6r5r4r3r2r1q9Tq7q6q5q4q3q2q1q0p9p7Tp5Tp3Tp1p0To8o7o6To4o3o2To0
$$ plain form
34661 67896 67547 67197 66846 66494 66141 65788 65433 65078 64722 64366 64009 63651 63293 62935 62576 62217 61857 61497 61138 60777 60417 60057 59697 59336 58976 58616 58256 57896 57536 57177 56818 56459 56100 55742 55385 55028 54671 54315 53959 53604 53250 52897 52544 52191 51840 51489 51140 50791
34709 50791 50443 50095 49749 49404 49059 48716 48373 48032 47692 47352 47014 46677 46341 46006 45673 45340 45009 44679 44350 44022 43696 43371 43047 42725 42403 42083 41765 41448 41132 40817 40504 40192 39881
34742 39881 39572 39264 38958 38653 38349 38047 37746 37447 37149 36852 36557 36263 35971 35680 35390 35102 34815 34530 34246 33964 33683 33403 33125 32848 32572 32298 32026 31755 31485
34771 31485 31216 30950 30684 30420 30157 29895 29635 29377 29119 28863 28609 28356 28104 27853 27604 27356 27110 26865 26621 26379 26137 25898 25659 25422 25186 24952 24718 24486 24256 24026 23798 23572 23346 23122
34805 23122 22899 22677 22457 22238 22020 21803 21588 21374 21161 20949 20739 20530 20322 20115 19910 19706 19503 19301 19100 18901 18703 18506 18311 18116 17923 17731 17540 17351 17162 16975 16789
34836 16789 16605 16421 16239 16058 15878 15699 15521 15345 15170 14996 14823 14652 14482 14312 14144 13978 13812 13648 13485 13323 13162 13002 12844 12687 12531 12376 12222 12070 11919 11769 11620
34867 11620 11472 11326 11181 11037 10894 10752 10612 10472 10334 10197 10061 9927 9794 9661 9530 9400 9272 9144 9018 8893 8769 8646 8525 8404 8285 8167 8050 7934 7820 7706 7594 7483 7373
34900 7373 7264 7157 7050 6945 6841 6738 6636 6535 6436 6337 6240 6144 6049 5955 5862 5770 5679 5590 5501 5414 5328 5243 5159 5076 4994 4913 4833 4754 4677 4600 4525 4450 4377 4304 4233 4163 4093 4025 3958 3892 3826 3762 3699 3637 3575 3515
34946C515n9Tn7Tn5Tn3Tn2n1n0m9m8m7Tm5Tm3Tm2m1Tl9Tl7Ul5l4Tl3l2Tl0Tk9k8Tk7k6k5Tk3k4k2Tk1k0Tj9j8Tj7j6T
35001A530j5j4Tj3j2Tj1Tj0TqrpqoTnUlmkUjT%J%KULTMTNTOTPOQURUJ0TJ1UJ2TJ3UJ4UJ5UJ6J5J7J6J7TJ8VJ9VK0VK1W
35088B075K2VK3K2K3VK4K3K4XK5K4K5K4K5UK4K5WK6K5S1K4K5TK4K5K4UK5K3K4TK3K4K3VK2K3K2TK1K2K1K2K0K1K0K1K0
35162C821J9K0J9TJ8J9J8J7J8J7TJ6VJ5TJ4J5J3J4J3TJ2UJ1UJ0RJ0RQUPUOTNTMULTKUJ%Jj%jkUlUmnVopUqUrj0rj0j1
35242D257j0j2j1j2Tj3Uj4Uj5Tj6j5j6j7j6j7Tj8Vj9Vk0Wk1Uk2k1k2Wk3Tk2k3Uk4k3Tk4k3k4Uk3k4Yk3k4Vk3k4Tk3k4
35317B757k3Yk2Tk3k2k1k2k1k2k1Tk0k1k0Tj9k0j9Tj8Vj7Uj6Uj5Uj4Tj3Tj2Uj1Tj0UqrqpToTnTmTlkTjT%JTKLTMTOTPT
35395A829QRJ0TJ1J2J3J4TJ5J6J7J8TK0TK1K2K3K4K5K6TK8K9TL1L2TL4L5TL7L8L9M0M1M3TM4M6M7M8M9N0N2N3N4N5N7T
35446C399N9O1TO3O4O6O7O8O9P1P3TP5P7P8P9Q1Q2Q4Q5Q7Q8R0R1R3R4R6R7R9J00J02J04J05J07J09J10J12J13J15J17
$$ plain form
34946 3515 3456 3397 3340 3283 3228 3173 3120 3067 3015 2964 2914 2865 2817 2770 2723 2678 2633 2590 2547 2505 2464 2423 2384 2345 2308 2271 2234 2199 2165 2131 2098 2066 2034 2004 1974 1945 1917 1889 1862 1836 1811 1786 1763 1739 1717 1695 1674 1654 1634 1615 1597 1579 1562 1546 1530
35001 1530 1515 1501 1487 1474 1462 1450 1439 1428 1418 1408 1400 1391 1384 1376 1370 1364 1359 1354 1349 1346 1342 1340 1338 1336 1335 1334 1334 1335 1335 1337 1339 1341 1344 1347 1351 1355 1360 1365 1371 1377 1384 1390 1398 1406 1414 1423 1432 1441 1451 1461 1472 1483 1494 1506 1518 1531 1544 1557 1571 1585 1599 1614 1629 1644 1660 1675 1692 1708 1725 1742 1760 1778 1796 1814 1833 1852 1871 1890 1910 1930 1950 1970 1991 2012 2033 2054 2075
35088 2075 2097 2119 2141 2163 2186 2208 2231 2254 2277 2300 2324 2347 2371 2395 2419 2443 2467 2491 2516 2540 2565 2589 2614 2639 2664 2688 2713 2738 2763 2788 2813 2839 2864 2889 2914 2939 2964 2989 3014 3039 3064 3089 3114 3138 3163 3188 3212 3237 3261 3285 3309 3334 3357 3381 3405 3428 3452 3475 3498 3521 3544 3566 3589 3611 3633 3654 3676 3697 3719 3739 3760 3780 3801 3821
35162 3821 3840 3860 3879 3898 3916 3935 3953 3970 3988 4005 4022 4038 4054 4070 4086 4101 4116 4130 4145 4158 4172 4185 4198 4210 4222 4234 4245 4256 4267 4277 4286 4296 4305 4313 4321 4329 4336 4343 4350 4356 4362 4367 4372 4376 4380 4384 4387 4390 4392 4394 4396 4397 4397 4398 4397 4397 4396 4394 4392 4390 4387 4384 4381 4377 4372 4367 4362 4357 4351 4344 4337 4330 4322 4314 4306 4297 4287 4278 4268 4257
35242 4257 4247 4235 4224 4212 4200 4187 4174 4161 4147 4133 4119 4104 4089 4073 4058 4042 4025 4009 3992 3975 3957 3939 3921 3903 3884 3865 3846 3827 3807 3787 3767 3747 3727 3706 3685 3664 3642 3621 3599 3577 3555 3533 3511 3488 3465 3443 3420 3397 3374 3350 3327 3304 3280 3257 3233 3209 3185 3162 3138 3114 3090 3066 3042 3018 2994 2971 2947 2923 2899 2875 2852 2828 2804 2781 2757
35317 2757 2734 2711 2688 2665 2642 2619 2596 2574 2552 2529 2507 2486 2464 2443 2421 2400 2379 2359 2338 2318 2298 2279 2259 2240 2221 2203 2185 2167 2149 2132 2115 2098 2082 2066 2050 2035 2020 2005 1991 1977 1964 1951 1939 1927 1915 1904 1893 1883 1873 1863 1855 1846 1838 1831 1824 1818 1812 1807 1802 1798 1794 1791 1789 1787 1786 1785 1785 1786 1787 1789 1792 1795 1799 1803 1809 1815 1822 1829
35395 1829 1837 1846 1856 1866 1877 1889 1902 1916 1930 1945 1961 1978 1996 2014 2034 2054 2075 2097 2120 2144 2169 2195 2221 2249 2278 2307 2338 2370 2402 2436 2471 2506 2543 2581 2620 2660 2701 2744 2787 2831 2877 2924 2972 3021 3071 3123 3176 3230 3285 3342 3399
35446 3399 3458 3519 3580 3643 3707 3773 3840 3908 3977 4048 4121 4194 4269 4346 4424 4503 4584 4666 4750 4835 4922 5010 5100 5191 5284 5378 5474 5571 5670 5770 5872 5976 6081 6188 6297 6407 6519 6632 6747 6864
35486F864J18J21TJ24J25J27J29J30J32J34J36J37J39J41J43J45J46J48J50J52J53J56J57J59J61J63J65J66J69J70
35516A1181J72J74J76J78J80J82J83J86J87J90J91J93J95J98J99K01K03K05K07K09K11K13K15K17K19K21K23K25K27
35545A6961K30K31K33K35K38K39K42K43K46K48K50K52K54K57K58K61K63K65K67K70K71K74K76K79K80K83K85K88K90
35574B4469K92K94K97K99L02L04L07L09L11L14L16L19L22L24L27L29L32L35L37L40L43L45L49L51L54L57L60L63L65
35603C3966L69L72L75L78L81L84L88L91L94L97M01M04M08M11M15M18M22M25M30M32M37M41M44M48M53M56M60M65M68
35632D6033M73M77M81M86M90M94M99N04N08N13N17N22N27N32N36N42N47N51N57N62N67N72N78N83N88N94N99O05O10
35661F1647O16O21O28O33O39O44O51O56O63O68O75O80O87O93O99P05P11P18P24P30P37P43P49P56P63P68P76P81P89
35690H1950P94Q01Q08Q14Q21Q28Q33Q41Q47Q53Q60Q66Q73Q80Q85Q92Q99R05R11R18R23R30R36R43R48R55R60R66R72
$$ plain form
35486 6864 6982 7103 7224 7348 7473 7600 7729 7859 7991 8125 8261 8398 8537 8678 8821 8966 9112 9260 9410 9562 9715 9871 10028 10187 10348 10511 10676 10842 11011 11181
35516 11181 11353 11527 11703 11881 12061 12243 12426 12612 12799 12989 13180 13373 13568 13766 13965 14166 14369 14574 14781 14990 15201 15414 15629 15846 16065 16286 16509 16734 16961
35545 16961 17191 17422 17655 17890 18128 18367 18609 18852 19098 19346 19596 19848 20102 20359 20617 20878 21141 21406 21673 21943 22214 22488 22764 23043 23323 23606 23891 24179 24469
35574 24469 24761 25055 25352 25651 25953 26257 26564 26873 27184 27498 27814 28133 28455 28779 29106 29435 29767 30102 30439 30779 31122 31467 31816 32167 32521 32878 33238 33601 33966
35603 33966 34335 34707 35082 35460 35841 36225 36613 37004 37398 37795 38196 38600 39008 39419 39834 40252 40674 41099 41529 41961 42398 42839 43283 43731 44184 44640 45100 45565 46033
35632 46033 46506 46983 47464 47950 48440 48934 49433 49937 50445 50958 51475 51997 52524 53056 53592 54134 54681 55232 55789 56351 56918 57490 58068 58651 59239 59833 60432 61037 61647
35661 61647 62263 62884 63512 64145 64784 65428 66079 66735 67398 68066 68741 69421 70108 70801 71500 72205 72916 73634 74358 75088 75825 76568 77317 78073 78836 79604 80380 81161 81950
35690 81950 82744 83545 84353 85167 85988 86816 87649 88490 89337 90190 91050 91916 92789 93669 94554 95446 96345 97250 98161 99079 100002 100932 101868 102811 103759 104714 105674 106640 107612
35719A07612R78R84R90R95J000J007J011J017J022J027J032J037J042J047J052J056J060J065J069J073J077J081J085
35742A31419J089J091J096J098J102J104J107J110J113J114J117J119J121J123J124J125J127TJ129TJ130WJ129TJ128
35770A62720J126TJ124J123J121J119J116J114J112J109J105J103J098J096J091J087J083J078J074J068J064J058
35792A86915J052J046J041J034J027J021J014J007J000R91R85R76R68R59R51R42R33R23R15R04Q95Q84Q75Q63Q54Q42
35818B11817Q31Q20Q09P96P86P73P61P48P36P24P10O98O84O71O58O43O31O16O02N87N74N58N45N29N14N00M84M69M54
35847B30728M38M23M06L92L75L59L43L27L11K95K78K62K46K29K12J96J79J62J46J28J12R6P8O1M5K7J1ok3m0n7p3r1
35880B36575j07j24j41j57j74j91k08k23k41k57k73k89l06l22l37l54l70l86m01m17m32m48m63m79m93n08n24n38n53
35909B26859n67n82n95o10o24o38o52o65o78o92p05p18p30p43p56p68p80p93q03q16q27q39q49q61q71q82q92r03r13
$$ plain form
35719 107612 108590 109574 110564 111559 112559 113566 114577 115594 116616 117643 118675 119712 120754 121801 122853 123909 124969 126034 127103 128176 129253 130334 131419
35742 131419 132508 133599 134695 135793 136895 137999 139106 140216 141329 142443 143560 144679 145800 146923 148047 149172 150299 151426 152555 153684 154814 155944 157074 158204 159334 160463 161592 162720
35770 162720 163846 164972 166096 167219 168340 169459 170575 171689 172801 173910 175015 176118 177216 178312 179403 180490 181573 182651 183725 184793 185857 186915
35792 186915 187967 189013 190054 191088 192115 193136 194150 195157 196157 197148 198133 199109 200077 201036 201987 202929 203862 204785 205700 206604 207499 208383 209258 210121 210975 211817
35818 211817 212648 213468 214277 215073 215859 216632 217393 218141 218877 219601 220311 221009 221693 222364 223022 223665 224296 224912 225514 226101 226675 227233 227778 228307 228821 229321 229805 230274 230728
35847 230728 231166 231589 231995 232387 232762 233121 233464 233791 234102 234397 234675 234937 235183 235412 235624 235820 235999 236161 236307 236435 236547 236643 236721 236782 236827 236854 236865 236859 236836 236796 236739 236666 236575
35880 236575 236468 236344 236203 236046 235872 235681 235473 235250 235009 234752 234479 234190 233884 233562 233225 232871 232501 232115 231714 231297 230865 230417 229954 229475 228982 228474 227950 227412 226859
35909 226859 226292 225710 225115 224505 223881 223243 222591 221926 221248 220556 219851 219133 218403 217660 216904 216136 215356 214563 213760 212944 212117 211278 210429 209568 208697 207815 206923 206020 205107
35938B05107r22r32r42r51r60r69r78r86r95j003j011j019j026j034j041j048j054j062j067j074j080j086j092j097
35962A80678j102j107j112j117j121j126j129j134j137j141j144j147j150j152j156j157j160j162j164j165j167T
35984A55561j169j170j171Uj172Tj171Uj170j169j168j167j165j164j162j161j158j157j154j151j149j146j144j140
36010A25327j137j134j130j126j123j119j115j111j106j102j097j093j088j083j078j073j068j062j056j051j046j039
36032A01290j034j027j022j015j009j002r96r89r83r76r69r62r55r48r40r34r26r19r11r04q96q88q81q73q65q57q49
36059G5760q41q33q25q17q09q00p93p83p76p67p59p50p42p33p25p16p08o99o90o82o73o65o56o47o38o30o21o13o04
36088E4765n95n86n78n69n60n52n43n34n26n17n09n00m91m83m75m66m57m49m41m32m24m15m07l99l91l83l74l66l59
36117D0984l50l42l35l26l19l11l03k95k88k80k72k65k58k50k43k36k28k21k14k07k00j93j87j79j73j66j59j53j46
$$ plain form
35938 205107 204185 203253 202311 201360 200400 199431 198453 197467 196472 195469 194458 193439 192413 191379 190338 189290 188236 187174 186107 185033 183953 182867 181775 180678
35962 180678 179576 178469 177357 176240 175119 173993 172864 171730 170593 169452 168308 167161 166011 164859 163703 162546 161386 160224 159060 157895 156728 155561
35984 155561 154392 153222 152051 150880 149709 148537 147365 146194 145023 143852 142682 141513 140345 139178 138013 136849 135687 134526 133368 132211 131057 129906 128757 127611 126467 125327
36010 125327 124190 123056 121926 120800 119677 118558 117443 116332 115226 114124 113027 111934 110846 109763 108685 107612 106544 105482 104426 103375 102329 101290
36032 101290 100256 99229 98207 97192 96183 95181 94185 93196 92213 91237 90268 89306 88351 87403 86463 85529 84603 83684 82773 81869 80973 80085 79204 78331 77466 76609 75760
36059 75760 74919 74086 73261 72444 71635 70835 70042 69259 68483 67716 66957 66207 65465 64732 64007 63291 62583 61884 61194 60512 59839 59174 58518 57871 57233 56603 55982 55369 54765
36088 54765 54170 53584 53006 52437 51877 51325 50782 50248 49722 49205 48696 48196 47705 47222 46747 46281 45824 45375 44934 44502 44078 43663 43256 42857 42466 42083 41709 41343 40984
36117 40984 40634 40292 39957 39631 39312 39001 38698 38403 38115 37835 37563 37298 37040 36790 36547 36311 36083 35862 35648 35441 35241 35048 34861 34682 34509 34343 34184 34031 33885
36146C3885j40j34j27j21j15j08j03r7r0q5q0p3o8o2n7n1m6m1l5l0k6k0j5j0ojMRJ3J8K2K6L0L5L9M3M7N1N5N9O3O6P0
36189C2794P3P7Q0Q4Q7R1R3R7J00J03J06J09J11J15J17J20J23J25J28J30J33J36J37J40J43J44J47J49J50J53J55J57
36221C6607J59J61J63J64J67J68J70J71J73J75J77TJ80J81J82J84J86TJ88J90J91J92J93J95TJ97J99TK01TK03K04K05
36254D2684K07TK08K09K11TK12K14TK15K16K17K19TK20TK22K23TK25TK26K27K28TK30TK31K32K33TK34K35K36TK38U
36292E1174K40TK41TK43K42K44TK45TK46K47TK48TK49TK50TK51TK52UK53TK54K53K54K55K54K55K54K55VK56K55UK54
36334F1671K55K54K55K53K54K53TK52UK50K51K49TK48K47K46TK44TK42TK40K39K38K36K35K34K32K30K29K28K25K24
36368F9952K22K20K18K17K14K12K09K08K05K03K01J97J96J93J90J87J85J81J79J76J73J70J66J64J60J57J53J50J47
36397G5405J43J39J36J32J28J25J20J17J12J09J05J00R7R2Q8Q3P9P5P1O6O1N7N3M8M3L8L4K9K5J9J5J0N%mj0j4k0k4k9
$$ plain form
36146 33885 33745 33611 33484 33363 33248 33140 33037 32940 32850 32765 32685 32612 32544 32482 32425 32374 32328 32287 32252 32222 32196 32176 32161 32151 32145 32144 32148 32157 32170 32188 32210 32236 32266 32301 32340 32383 32430 32481 32536 32595 32658 32724 32794
36189 32794 32867 32944 33024 33108 33195 33286 33379 33476 33576 33679 33785 33894 34005 34120 34237 34357 34480 34605 34733 34863 34996 35132 35269 35409 35552 35696 35843 35992 36142 36295 36450 36607
36221 36607 36766 36927 37090 37254 37421 37589 37759 37930 38103 38278 38455 38632 38812 38993 39175 39359 39545 39731 39919 40109 40300 40492 40685 40880 41075 41272 41471 41670 41871 42072 42275 42479 42684
36254 42684 42891 43098 43306 43515 43726 43937 44149 44363 44577 44792 45008 45225 45444 45663 45883 46103 46325 46548 46771 46996 47221 47447 47674 47902 48130 48360 48590 48821 49053 49286 49519 49753 49988 50224 50460 50698 50936 51174
36292 51174 51414 51654 51895 52136 52379 52621 52865 53109 53354 53599 53845 54092 54339 54587 54835 55084 55333 55583 55833 56084 56335 56587 56839 57091 57344 57597 57851 58104 58358 58613 58867 59122 59376 59631 59886 60141 60396 60652 60907 61162 61417 61671
36334 61671 61926 62180 62435 62688 62942 63195 63448 63700 63952 64204 64454 64705 64954 65203 65451 65698 65944 66190 66434 66678 66920 67162 67402 67641 67879 68115 68350 68584 68816 69046 69275 69503 69728 69952
36368 69952 70174 70394 70612 70829 71043 71255 71464 71672 71877 72080 72281 72478 72674 72867 73057 73244 73429 73610 73789 73965 74138 74308 74474 74638 74798 74955 75108 75258 75405
36397 75405 75548 75687 75823 75955 76083 76208 76328 76445 76557 76666 76771 76871 76968 77060 77148 77231 77310 77385 77456 77522 77583 77640 77693 77741 77784 77822 77856 77885 77910 77929 77944 77954 77959 77959 77955 77945 77931 77911 77887 77858
36437G7858l5l9m4n0n4n9o4p0p4p9q5q9r4r9j05j09j14j19j24j28j34j38j43j48j53j58j62j66j72j76j80j85j90j94
36471G3925j98k03k07k11k16k20k23k28k32k36k40k43k48k51k55k58k62k65k69k73k75k79k82k85k88k91k94k97l00
36500F6596l02l05l07l10l12l15l17l19l21l23l26l27l29l30l33l34l35l37l38l39l41l42l43l44l45Tl47Tl48Tl49U
36533E5640l50Zl49Tl48Ul47l46l45Tl44l42Tl41l40l38Tl36l35l33l32l30l29l28l25l24l23l20l19l17l15l13l11
36573D2140l09l07l05l02l01k98k96k93k92k88k87k84k82k79k76k74k72k68k66k64k61k58k55k52k50k46k44k41k38
36602C4152k36k32k29k26k24k20k17k14k11k07k05k02j98j95j92j88j86j82j78j76j72j68j66j61j59j55j51j48j45
36631B8609j40j38j34j30j26j23j19j15j12j08j04j00r7r2q9q5q0p7p3o8o5o0n6n2m8m3l9l5l0k6k1j7j2plKPJ1J7K1
36671B6043K7L1L7M1M7N3N7O3O9P4P9Q5R1R7J03J08J15J20J27J33J39J46J52J58J65J72J79J85J92K00K06K14K21K28
$$ plain form
36437 77858 77823 77784 77740 77690 77636 77577 77513 77443 77369 77290 77205 77116 77022 76923 76818 76709 76595 76476 76352 76224 76090 75952 75809 75661 75508 75350 75188 75022 74850 74674 74494 74309 74119 73925
36471 73925 73727 73524 73317 73106 72890 72670 72447 72219 71987 71751 71511 71268 71020 70769 70514 70256 69994 69729 69460 69187 68912 68633 68351 68066 67778 67487 67193 66896 66596
36500 66596 66294 65989 65682 65372 65060 64745 64428 64109 63788 63465 63139 62812 62483 62153 61820 61486 61151 60814 60476 60137 59796 59454 59111 58767 58422 58077 57730 57383 57035 56687 56338 55989 55640
36533 55640 55290 54940 54590 54240 53890 53540 53190 52840 52491 52142 51794 51446 51098 50751 50405 50060 49715 49371 49029 48687 48346 48006 47668 47330 46994 46659 46326 45994 45664 45335 45007 44682 44358 44035 43715 43396 43079 42764 42451 42140
36573 42140 41831 41524 41219 40917 40616 40318 40022 39729 39437 39149 38862 38578 38296 38017 37741 37467 37195 36927 36661 36397 36136 35878 35623 35371 35121 34875 34631 34390 34152
36602 34152 33916 33684 33455 33229 33005 32785 32568 32354 32143 31936 31731 31529 31331 31136 30944 30756 30570 30388 30210 30034 29862 29694 29528 29367 29208 29053 28902 28754 28609
36631 28609 28469 28331 28197 28067 27941 27818 27699 27584 27472 27364 27260 27160 27063 26971 26882 26797 26717 26640 26567 26499 26434 26374 26318 26266 26218 26175 26136 26101 26071 26045 26024 26007 25995 25988 25985 25987 25994 26005 26022 26043
36671 26043 26070 26101 26138 26179 26226 26279 26336 26399 26468 26542 26621 26706 26797 26894 26997 27105 27220 27340 27467 27600 27739 27885 28037 28195 28360 28532 28711 28896 29088 29288 29494 29708 29929 30157
36705C0157K35K44K50K59K66K74K82K90K98L07L15L23L32L40L49L58L66L76L85L94M03M12M22M32M41M51M60M71M81
36734D0373M90N01N11N22N32N42N53N64N74N86N96O08O18O30O41O53O64O75O87O99P10P23P34P46P58P70P82P94Q07
36763E9043Q19Q31Q43Q56Q69Q80Q94R06R18R31R44R57R69R82R94J008J020J033J045J058J071J084J096J109J122J134
36789H4416J147J160J172J184J197J210J221J234J246J259J270J282J294J307J317J330J341J352J364J375J386J397
36811A12461J407J419J429J440J449J460J470J480J489J499J508J517J527J534J544J552J560J567J576J583J590J597
36833A45658J605J610J617J623J629J635J639J645J650J654J658J662J666J669J672J675J677J680J681J683J684J685
36855A82057J686UJ685J684TJ682J680J678J675J673J669J666J662J658J653J648J643J637J631J624J618J610J603
36879B21878J595J587J577J569J560J549J539J529J518J507J494J483J471J457J445J431J417J403J388J373J358J343
$$ plain form
36705 30157 30392 30636 30886 31145 31411 31685 31967 32257 32555 32862 33177 33500 33832 34172 34521 34879 35245 35621 36006 36400 36803 37215 37637 38069 38510 38961 39421 39892 40373
36734 40373 40863 41364 41875 42397 42929 43471 44024 44588 45162 45748 46344 46952 47570 48200 48841 49494 50158 50833 51520 52219 52929 53652 54386 55132 55890 56660 57442 58236 59043
36763 59043 59862 60693 61536 62392 63261 64141 65035 65941 66859 67790 68734 69691 70660 71642 72636 73644 74664 75697 76742 77800 78871 79955 81051 82160 83282 84416
36789 84416 85563 86723 87895 89079 90276 91486 92707 93941 95187 96446 97716 98998 100292 101599 102916 104246 105587 106939 108303 109678 111064 112461
36811 112461 113868 115287 116716 118156 119605 121065 122535 124015 125504 127003 128511 130028 131555 133089 134633 136185 137745 139312 140888 142471 144061 145658
36833 145658 147263 148873 150490 152113 153742 155377 157016 158661 160311 161965 163623 165285 166951 168620 170292 171967 173644 175324 177005 178688 180372 182057
36855 182057 183743 185429 187115 188800 190484 192168 193850 195530 197208 198883 200556 202225 203891 205553 207211 208864 210512 212155 213792 215423 217047 218665 220275 221878
36879 221878 223473 225060 226637 228206 229766 231315 232854 234383 235901 237408 238902 240385 241856 243313 244758 246189 247606 249009 250397 251770 253128 254471
36901B54471J326J310J293J277J258J242J223J205J186J167J148J128J109J088J067J047J026J004R82R61R38R16Q94
36924B80266Q70Q47Q23Q00P76P52P28P02O79O53O28O03N77N52N25N00M74M47M21L95L68L41L15K87K61K33K06J79J52
36953B95360J25R7O9M3J5j3m0o7r5j22j49j77k04k31k59k85l12l40l66l92m19m46m72m98n25n50n76o01o27o53o77p02
36985B85911p27p51p76p99q24q46q71q93r17r38r62r83j005j027j048j069j090j110j130j150j169j189j207j226j244
37010B60960j262j279j297j314j330j346j362j377j393j407j422j436j449j463j475j489j500j512j524j535j545j556
37032B29687j566j575j585j593j602j610j618j625j632j639j644j651j656j661j666j670j675j678j681j684j687j689
37054A93600j691j692j694Tj695Vj693Tj691j689j687j685j682j679j676j672j668j664j659j655j650j645j639j633
37080A49989j627j621j614j608j601j593j586j578j570j562j554j546j536j528j519j509j500j490j481j471j460j451
$$ plain form
36901 254471 255797 257107 258400 259677 260935 262177 263400 264605 265791 266958 268106 269234 270343 271431 272498 273545 274571 275575 276557 277518 278456 279372 280266
36924 280266 281136 281983 282806 283606 284382 285134 285862 286564 287243 287896 288524 289127 289704 290256 290781 291281 291755 292202 292623 293018 293386 293727 294042 294329 294590 294823 295029 295208 295360
36953 295360 295485 295582 295651 295694 295709 295696 295656 295589 295494 295372 295223 295046 294842 294611 294352 294067 293755 293415 293049 292657 292238 291792 291320 290822 290297 289747 289171 288570 287943 287290 286613 285911
36985 285911 285184 284433 283657 282858 282034 281188 280317 279424 278507 277569 276607 275624 274619 273592 272544 271475 270385 269275 268145 266995 265826 264637 263430 262204 260960
37010 260960 259698 258419 257122 255808 254478 253132 251770 250393 249000 247593 246171 244735 243286 241823 240348 238859 237359 235847 234323 232788 231243 229687
37032 229687 228121 226546 224961 223368 221766 220156 218538 216913 215281 213642 211998 210347 208691 207030 205364 203694 202019 200341 198660 196976 195289 193600
37054 193600 191909 190217 188523 186829 185134 183439 181744 180049 178356 176663 174972 173283 171596 169911 168229 166550 164874 163202 161534 159870 158211 156556 154906 153261 151622 149989
37080 149989 148362 146741 145127 143519 141918 140325 138739 137161 135591 134029 132475 130929 129393 127865 126346 124837 123337 121847 120366 118895 117435 115984
37102A15984j440j429j419j408j397j386j375j364j352j341j329j318j306j294j282j271j258j246j234j222j210j198
37124H6905j185j173j160j148j136j123j110j099j085j074j061j048j036j023j011r99r86r74r62r49r37r25r13r00
37148F1888q89q76q65q52q41q29q17q06p94p82p71p60p48p38p26p15p04o93o82o72o61o51o40o30o20o09o00n90n80
37177D0747n70n60n51n42n32n23n14n05m97m87m79m70m62m53m46m37m29m21m13m06l98l91l83l76l69l62l55l48l41
37206B7727l35l28l21l16l09l03k97k91k85k79k74k68k63k57k52k47k42k36k32k27k22k18k12k09k04j99j95j91j87
37235B0328j82j79j75j71j67j63j59j56j53j49j45j42j39j35j32j29j26j23j19j17j13j11j08j05j02j00r6r4r2q8q6
37266A6272q4q1p8p6p3p1o9o6o3o2n8n7n4n2m9m7m5m3m0l8l5l4l1k8k7k4k2k0j7j5j3j0qoljJLORJ0J3J6J8K0K3K5K7
37314A4943L1L2L5L8M0M3M5M8N1N3N6N8O1O4O6P0P2P4P8Q0Q3Q6Q8R2R4R7J00J03J06J09J11J15J17J21J23J27J29J33
$$ plain form
37102 115984 114544 113115 111696 110288 108891 107505 106130 104766 103414 102073 100744 99426 98120 96826 95544 94273 93015 91769 90535 89313 88103 86905
37124 86905 85720 84547 83387 82239 81103 79980 78870 77771 76686 75612 74551 73503 72467 71444 70433 69434 68448 67474 66512 65563 64626 63701 62788 61888
37148 61888 60999 60123 59258 58406 57565 56736 55919 55113 54319 53537 52766 52006 51258 50520 49794 49079 48375 47682 47000 46328 45667 45016 44376 43746 43126 42517 41917 41327 40747
37177 40747 40177 39617 39066 38524 37992 37469 36955 36450 35953 35466 34987 34517 34055 33602 33156 32719 32290 31869 31456 31050 30652 30261 29878 29502 29133 28771 28416 28068 27727
37206 27727 27392 27064 26743 26427 26118 25815 25518 25227 24942 24663 24389 24121 23858 23601 23349 23102 22860 22624 22392 22165 21943 21725 21513 21304 21100 20901 20706 20515 20328
37235 20328 20146 19967 19792 19621 19454 19291 19132 18976 18823 18674 18529 18387 18248 18113 17981 17852 17726 17603 17484 17367 17254 17143 17035 16930 16828 16728 16632 16538 16446 16358 16272
37266 16272 16188 16107 16029 15953 15880 15809 15740 15674 15611 15549 15491 15434 15380 15328 15279 15232 15187 15144 15104 15066 15031 14997 14966 14938 14911 14887 14865 14845 14828 14813 14800 14790 14782 14776 14773 14772 14773 14776 14782 14791 14801 14814 14830 14848 14868 14891 14916 14943
37314 14943 14974 15006 15041 15079 15119 15162 15207 15255 15306 15359 15415 15473 15534 15598 15664 15734 15806 15880 15958 16038 16121 16207 16295 16387 16481 16578 16678 16781 16887 16996 17107 17222 17339 17460 17583 17710 17839 17972
37352A7972J35J38J42J44J48J50J54J56J60J63J65J69J72J75J78J80J84J87J90J93J96J99K02K05K07K11K14K16K20
37381B3125K22K25K28K31K33K37K39K41K45K47K50K52K55K58K60K62K65K67K70K72K74K76K79K81K83K85K87K89K91
37410C0629K92K95K96K98L00L01L03L04L06L07L09TL11L12L13L14L15L16TL18UL19L20VL21L20L21L20L21L20TL19U
37447D2199L18L17L16TL15L13TL11L10L09L07L06L05L02L01K99K97K96K93K91K89K86K85K81K80K76K74K71K69K65K63
37478E1373K59K57K53K50K46K44K39K37K32K29K25K22K17K14K10K05K02J97J93J89J85J80J76J72J67J62J58J53J48
37507E7394J44J39J34J30J24J20J14J10J05R9R5R0Q4Q0P4P0O4N9N4M8M4L8L4K8K2J8J3PKlqj3j8k3k9l3l8m4m8n3n8o3
37549E9106o8p3p7q2q7r1r6j01j05j10j13j19j22j27j31j35j39j43j47j51j55j59j62j66j69j73j76j80j83j86j89j92
37581E4799j95j98k01k03k06k09k11k13k16k18k20k22k25k26k27k30k31k32k34k36Tk38k39Tk41Tk43k42k44k43k44
$$ plain form
37352 17972 18107 18245 18387 18531 18679 18829 18983 19139 19299 19462 19627 19796 19968 20143 20321 20501 20685 20872 21062 21255 21451 21650 21852 22057 22264 22475 22689 22905 23125
37381 23125 23347 23572 23800 24031 24264 24501 24740 24981 25226 25473 25723 25975 26230 26488 26748 27010 27275 27542 27812 28084 28358 28634 28913 29194 29477 29762 30049 30338 30629
37410 30629 30921 31216 31512 31810 32110 32411 32714 33018 33324 33631 33940 34249 34560 34872 35185 35499 35814 36130 36446 36764 37082 37400 37719 38039 38359 38679 38999 39320 39640 39961 40281 40602 40922 41242 41561 41880 42199
37447 42199 42517 42834 43150 43466 43781 44094 44407 44718 45028 45337 45644 45950 46255 46557 46858 47157 47454 47750 48043 48334 48623 48909 49194 49475 49755 50031 50305 50576 50845 51110 51373
37478 51373 51632 51889 52142 52392 52638 52882 53121 53358 53590 53819 54044 54266 54483 54697 54907 55112 55314 55511 55704 55893 56078 56258 56434 56606 56773 56935 57093 57246 57394
37507 57394 57538 57677 57811 57941 58065 58185 58299 58409 58514 58613 58708 58798 58882 58962 59036 59106 59170 59229 59283 59331 59375 59413 59447 59475 59497 59515 59528 59535 59537 59534 59526 59513 59495 59472 59443 59410 59372 59328 59280 59227 59169 59106
37549 59106 59038 58965 58888 58806 58719 58628 58532 58431 58326 58216 58103 57984 57862 57735 57604 57469 57330 57187 57040 56889 56734 56575 56413 56247 56078 55905 55729 55549 55366 55180 54991 54799
37581 54799 54604 54406 54205 54002 53796 53587 53376 53163 52947 52729 52509 52287 52062 51836 51609 51379 51148 50916 50682 50446 50210 49972 49733 49494 49253 49012 48769 48527 48283 48040 47796
37612D7796k45k44k45k44k45k44Uk43Tk42Tk40Tk39k38k36Tk34k33k31k30k29k27k25k23k21k20k17k15k14k11k08k07
37646C9897k04k01j99j97j93j91j89j85j83j80j77j74j70j68j65j61j58j55j52j48j46j41j38j35j32j27j25j21j17
37675C5165j13j10j07j03r9r5r2q9q4q1p7p4p0o6o3n8n6n1m8m5m0l7l4l0k6k3k0j6j2j0nlJMQJ0J4J7K0K4K6K9L2L5L8
37720C3586M1M3M6M9N1N4N6N9O1O4O6O7P1P2P4P6P8Q0Q1Q4Q5Q6Q8R0TR3TR4R6R7TR9TJ00J01TJ02TJ03UJ04J03J04J03
37765C7295J04J03TJ02J03J02J01TJ00R9R8TR7R5TR3R2R1R0Q8Q7Q5Q4Q2Q1P8P7P5P3P1O9O7O5O2O1N8N6N3N1M8M6M4M1
37808D0764L8L5L3L0K7K4K2J8J6J3J0OMJlnrj2j5j8k1k5k8l1l4l8m1m4m7n1n4n7o0o4o7p1p3p7q1q3q7r0r3r6j00j03
37854C9363j05j10j12j15j18j22j24j28j31j33j37j39j42j45j48j51j53j57j59j61j64j67j70j71j75j77j79j81j84
37883C5105j86j89j90j93j95j97j98k01k03k05k06k08k10k12k13k15k16k18k20Tk22k24Tk26k27k28k29k30k31k32k33
$$ plain form
37612 47796 47551 47307 47062 46818 46573 46329 46085 45841 45598 45355 45113 44871 44631 44391 44152 43914 43678 43442 43208 42975 42744 42514 42285 42058 41833 41610 41389 41169 40952 40737 40523 40312 40104 39897
37646 39897 39693 39492 39293 39096 38903 38712 38523 38338 38155 37975 37798 37624 37454 37286 37121 36960 36802 36647 36495 36347 36201 36060 35922 35787 35655 35528 35403 35282 35165
37675 35165 35052 34942 34835 34732 34633 34538 34446 34357 34273 34192 34115 34041 33971 33905 33842 33784 33728 33677 33629 33584 33544 33507 33473 33443 33417 33394 33374 33358 33346 33336 33331 33328 33329 33333 33341 33351 33365 33382 33402 33426 33452 33481 33513 33548 33586
37720 33586 33627 33670 33716 33765 33816 33870 33926 33985 34046 34110 34176 34243 34314 34386 34460 34536 34614 34694 34775 34859 34944 35030 35118 35208 35298 35391 35484 35578 35674 35771 35868 35967 36066 36166 36267 36368 36470 36572 36675 36778 36881 36985 37088 37192 37295
37765 37295 37399 37502 37605 37707 37810 37912 38013 38114 38214 38313 38411 38509 38606 38701 38796 38889 38981 39072 39162 39250 39337 39422 39506 39588 39669 39747 39824 39899 39972 40043 40112 40179 40244 40306 40367 40425 40481 40534 40585 40633 40679 40723 40764
37808 40764 40802 40837 40870 40900 40927 40951 40973 40991 41007 41020 41030 41036 41040 41041 41038 41033 41024 41012 40997 40979 40958 40933 40905 40874 40840 40802 40761 40717 40670 40619 40565 40508 40448 40384 40317 40246 40173 40096 40015 39932 39845 39755 39662 39566 39466 39363
37854 39363 39258 39148 39036 38921 38803 38681 38557 38429 38298 38165 38028 37889 37747 37602 37454 37303 37150 36993 36834 36673 36509 36342 36172 36001 35826 35649 35470 35289 35105
37883 35105 34919 34730 34540 34347 34152 33955 33757 33556 33353 33148 32942 32734 32524 32312 32099 31884 31668 31450 31230 31010 30788 30564 30340 30114 29887 29659 29430 29200 28969 28737 28504
37914B8504k34Tk35k36Tk37Tk38k39k38k39Tk40k39k40Tk39k40Uk39k40k39k38k39k38Tk37Tk36Tk35Tk34k33k32Tk31
37952A9495k30k29k28k27k26Tk24k23k22k21k20k18Tk16k15k13k12k11k10k08k07k05k04k03k01j99j98j97j94Tj92
37983A2904j90j88j87j86j83j82j81j78j77j76j73j72j70j69j67j65j63j62j60j58j56j55j52Tj49j48j45Tj42j41j38T
38015G656j35j34j32j30j28j27j25j24j21j20j19j16j15j13j12j10j08j07j05j03j02j01r8r7r6r4r2r1q9q8q6q5q3q2
38049C988q1p8Tp6p4Tp1To9o7o6o5o4o2o1n9Tn7n5Tn3n2n0Tm8m7m5Tm3m2m1m0l9l7Tl5l4l3l1Tk9Tk7k6k5k4k3k2k1j9T
38100A549j7Tj5j4j3j2j1j0qToTmlkj%JLTNOPRTJ1J2J3J5TJ7J8K0K1K2K3K5K7TK9L1L2L3L5L6L8M0M1M3M4M6M8M9N2N3
38155B361N4N7N8O1O2O4O6O8P1P2P5P6P9Q1Q3Q6Q8R1R2R6R7J01J03J05J09J11J14J16J20J22J26J28J31J35J38J41J44
38192E882J48J51J54J58J61J65J69J72J76J80J84J87J92J96K00K04K08K12K17K21K26K30K34K40K44K48K54K59K63K68
$$ plain form
37914 28504 28270 28036 27801 27565 27329 27092 26855 26617 26378 26140 25901 25662 25422 25183 24943 24703 24464 24224 23984 23744 23505 23265 23026 22788 22549 22311 22073 21836 21599 21363 21127 20892 20657 20423 20190 19958 19726 19495
37952 19495 19265 19036 18808 18581 18355 18129 17905 17682 17460 17239 17019 16801 16583 16367 16152 15939 15727 15516 15306 15098 14891 14686 14482 14279 14078 13879 13681 13484 13290 13096 12904
37983 12904 12714 12526 12339 12153 11970 11788 11607 11429 11252 11076 10903 10731 10561 10392 10225 10060 9897 9735 9575 9417 9261 9106 8954 8802 8653 8505 8360 8215 8073 7932 7794 7656
38015 7656 7521 7387 7255 7125 6997 6870 6745 6621 6500 6380 6261 6145 6030 5917 5805 5695 5587 5480 5375 5272 5170 5069 4971 4874 4778 4684 4592 4501 4412 4324 4238 4153 4070 3988
38049 3988 3907 3829 3751 3675 3601 3527 3456 3385 3316 3249 3183 3118 3054 2992 2931 2872 2813 2756 2701 2646 2593 2541 2491 2441 2393 2346 2301 2256 2213 2171 2130 2090 2051 2014 1977 1942 1908 1875 1844 1813 1784 1755 1728 1702 1677 1653 1630 1608 1587 1568 1549
38100 1549 1532 1515 1500 1486 1473 1461 1450 1440 1432 1424 1418 1412 1408 1405 1403 1402 1402 1403 1406 1409 1414 1420 1427 1436 1445 1456 1468 1481 1496 1511 1528 1546 1566 1587 1609 1632 1657 1684 1711 1740 1771 1803 1836 1871 1907 1945 1985 2026 2069 2113 2159 2207 2256 2308 2361
38155 2361 2415 2472 2530 2591 2653 2717 2783 2851 2922 2994 3069 3145 3224 3305 3388 3474 3562 3653 3745 3841 3938 4039 4142 4247 4356 4467 4581 4697 4817 4939 5065 5193 5324 5459 5597 5738 5882
38192 5882 6030 6181 6335 6493 6654 6819 6988 7160 7336 7516 7700 7887 8079 8275 8475 8679 8887 9099 9316 9537 9763 9993 10227 10467 10711 10959 11213 11472 11735 12003
38222A2003K74K78K84K89K94L00L05L10L16L22L27L34L38L45L51L56L63L68L75L81L87L93M00M06M12M19M26M32M39
38251B2227M45M52M59M66M73M79M87M93N01N08N14N22N29N36N44N50N58N66N72N80N87N95O02O10O17O24O32O39O47
38280C8014O54O62O69O77O84O91O99P07P13P22P28P36P43P51P57P65P73P79P86P94Q00Q08Q14Q21Q28Q35Q41Q48Q55
38309E9954Q61Q67Q74Q79Q86Q92Q98R04R10R15R21R26R32R37R42R47R52R57R61R66R70R74R79R82R86R90R93R97J000
38338H7152J003J006J008J011J014J015J018J020J021J022J024J025J026J027TJ028TJ027J028J027J026J025TJ023
38362A11656J021J020J018J016J013J011J008J005J001R99R94R91R86R82R77R73R67R63R56R51R45R39R32R26R19R12
38388A37081R04Q97Q89Q81Q73Q64Q56Q46Q38Q28Q19Q09P99P89P79P68P57P46P35P24P12P00O88O76O64O51O39O25O13
38417A59450N99N86N73N58N45N31N17N02M88M74M59M44M28M14L99L83L68L52L37L21L05K90K73K57K42K25K08J93J76
$$ plain form
38222 12003 12277 12555 12839 13128 13422 13722 14027 14337 14653 14975 15302 15636 15974 16319 16670 17026 17389 17757 18132 18513 18900 19293 19693 20099 20511 20930 21356 21788 22227
38251 22227 22672 23124 23583 24049 24522 25001 25488 25981 26482 26990 27504 28026 28555 29091 29635 30185 30743 31309 31881 32461 33048 33643 34245 34855 35472 36096 36728 37367 38014
38280 38014 38668 39330 39999 40676 41360 42051 42750 43457 44170 44892 45620 46356 47099 47850 48607 49372 50145 50924 51710 52504 53304 54112 54926 55747 56575 57410 58251 59099 59954
38309 59954 60815 61682 62556 63435 64321 65213 66111 67015 67925 68840 69761 70687 71619 72556 73498 74445 75397 76354 77315 78281 79251 80225 81204 82186 83172 84162 85155 86152 87152
38338 87152 88155 89161 90169 91180 92194 93209 94227 95247 96268 97290 98314 99339 100365 101392 102419 103447 104475 105502 106530 107557 108583 109608 110633 111656
38362 111656 112677 113697 114715 115731 116744 117755 118763 119768 120769 121768 122762 123753 124739 125721 126698 127671 128638 129601 130557 131508 132453 133392 134324 135250 136169 137081
38388 137081 137985 138882 139771 140652 141525 142389 143245 144091 144929 145757 146576 147385 148184 148973 149752 150520 151277 152023 152758 153482 154194 154894 155582 156258 156922 157573 158212 158837 159450
38417 159450 160049 160635 161208 161766 162311 162842 163359 163861 164349 164823 165282 165726 166154 166568 166967 167350 167718 168070 168407 168728 169033 169323 169596 169853 170095 170320 170528 170721 170897
38446A70897J59J44J26J11R3P7O1M3K8J0ok2m0n5p3q9j05j22j38j55j71j87k04k19k36k52k67k84k99l15l30l46l61
38479A67473l76l92m06m21m36m51m65m80m93n08n21n35n49n62n75n88o02o13o27o38o51o62o75o86o97p08p19p30p41
38508A50966p50p61p70p81p89p99q07q17q25q33q41q49q56q64q70q78q84q91q96r02r08r14r18r24r28r32r36r41r44
38537A25958r47r50r54r56r58r61r62r65Tr67r68r69Xr67Tr66r65r63r61r59r56r55r51r49r46r42r39r35r31r27r23
38572I2489r18r13r09r04q98q93q87q81q76q69q63q57q50q43q36q29q22q15q07p99p92p84p75p68p59p50p43p33p25
38601F8391p15p07o98o89o79o70o60o51o41o31o22o12o02n92n81n72n62n51n41n30n20n10m99m89m78m68m57m46m36
38630E1582m25m14m04l92l83l71l61l50l39l28l18l07k96k86k75k64k54k43k32k22k12k01j90j81j69j60j49j39j29
38659D3588j19j09r8q9p9o9o0m9m1l0k1j2kOJ6K5L4M3N1O1O9P7Q6R4J02J11J19J26J34J42J50J57J65J71J79J86J93
$$ plain form
38446 170897 171056 171200 171326 171437 171530 171607 171668 171711 171739 171749 171743 171721 171681 171626 171553 171464 171359 171237 171099 170944 170773 170586 170382 170163 169927 169675 169408 169124 168825 168510 168180 167834 167473
38479 167473 167097 166705 166299 165878 165442 164991 164526 164046 163553 163045 162524 161989 161440 160878 160303 159715 159113 158500 157873 157235 156584 155922 155247 154561 153864 153156 152437 151707 150966
38508 150966 150216 149455 148685 147904 147115 146316 145509 144692 143867 143034 142193 141344 140488 139624 138754 137876 136992 136101 135205 134303 133395 132481 131563 130639 129711 128779 127843 126902 125958
38537 125958 125011 124061 123107 122151 121193 120232 119270 118305 117340 116373 115405 114436 113467 112498 111529 110560 109591 108624 107657 106691 105726 104763 103802 102843 101887 100932 99981 99032 98086 97144 96205 95270 94339 93412 92489
38572 92489 91571 90658 89749 88845 87947 87054 86167 85286 84410 83541 82678 81821 80971 80128 79292 78463 77641 76826 76019 75220 74428 73644 72869 72101 71342 70592 69849 69116 68391
38601 68391 67676 66969 66271 65582 64903 64233 63573 62922 62281 61650 61028 60416 59814 59222 58641 58069 57507 56956 56415 55885 55365 54855 54356 53867 53389 52921 52464 52018 51582
38630 51582 51157 50743 50339 49947 49564 49193 48832 48482 48143 47815 47497 47190 46894 46608 46333 46069 45815 45572 45340 45118 44906 44705 44515 44334 44165 44005 43856 43717 43588
38659 43588 43469 43360 43262 43173 43094 43025 42965 42916 42875 42845 42824 42812 42810 42816 42832 42857 42891 42934 42985 43046 43115 43192 43278 43372 43474 43585 43704 43830 43964 44106 44256 44413 44578 44749 44928 45114 45307
38696D5307K00K06K13K20K25K32K38K44K50K56K61K67K72K77K82K87K92K97L01L06L10L13L18L22L26L29L32L36L39
38725E3358L42L45L48L50L53L55L57L60L61L63L64L66L67L69TL71TL72TL73UL72L73L72TL71L70TL68L67L66L65L62
38759F5760L61L60L57L55L53L51L48L45L43L40L37L34L30L28L24L20L16L13L09L05L01K96K92K88K83K79K73K69K64
38788G5034K59K54K49K44K38K32K27K22K16K10K04J98J93J86J80J74J68J61J55J49J43J35J30J23J16J09J03R6Q9Q3P5
38819H0355O9O2N5M9M1L4K8K0J4O%pj5k1k8l5m2m9n5o3o9p7q2r0r7j03j09j17j22j30j36j42j48j55j62j67j73j80j86
38858G7973j91j98k03k09k15k21k26k31k37k42k48k52k58k63k67k73k77k81k87k90k96k99l03l08l12l15l19l23l27
38887G0302l30l33l37l40l42l46l49l51l55l56l59l62l63l66l68l70l71l73l75l76l78l79l80l81l82l83Tl85l84l86
38917E9359l85l86Wl85Ul84Tl82Tl81l80l79l78l77l75l73Tl70l69l67l66l63l62l59l57l56l52l51l48l46l43l41l38
$$ plain form
38696 45307 45507 45713 45926 46146 46371 46603 46841 47085 47335 47591 47852 48119 48391 48668 48950 49237 49529 49826 50127 50433 50743 51056 51374 51696 52022 52351 52683 53019 53358
38725 53358 53700 54045 54393 54743 55096 55451 55808 56168 56529 56892 57256 57622 57989 58358 58727 59098 59469 59841 60213 60586 60959 61332 61704 62077 62449 62821 63192 63562 63932 64300 64667 65033 65398 65760
38759 65760 66121 66481 66838 67193 67546 67897 68245 68590 68933 69273 69610 69944 70274 70602 70926 71246 71562 71875 72184 72489 72790 73086 73378 73666 73949 74228 74501 74770 75034
38788 75034 75293 75547 75796 76040 76278 76510 76737 76959 77175 77385 77589 77787 77980 78166 78346 78520 78688 78849 79004 79153 79296 79431 79561 79684 79800 79909 80012 80108 80197 80280 80355
38819 80355 80424 80486 80541 80590 80631 80665 80693 80713 80727 80733 80733 80726 80711 80690 80662 80627 80585 80536 80481 80418 80349 80272 80190 80100 80003 79900 79791 79674 79552 79422 79286 79144 78996 78841 78679 78512 78339 78159 77973
38858 77973 77782 77584 77381 77172 76957 76736 76510 76279 76042 75800 75552 75300 75042 74779 74512 74239 73962 73681 73394 73104 72808 72509 72206 71898 71586 71271 70952 70629 70302
38887 70302 69972 69639 69302 68962 68620 68274 67925 67574 67219 66863 66504 66142 65779 65413 65045 64675 64304 63931 63556 63180 62802 62423 62043 61662 61280 60897 60514 60129 59745 59359
38917 59359 58974 58588 58202 57816 57430 57044 56659 56274 55889 55505 55121 54739 54357 53976 53596 53217 52839 52462 52087 51714 51341 50971 50602 50235 49869 49506 49144 48785 48428 48072 47720 47369 47021 46675 46332 45991 45653
38954D5653l35l33l30l27l24l21l18l15l12l09l06l02l00k96k93k89k86k83k79k76k72k69k66k62k58k55k51k48k44
38983C7194k41k37k33k30k26k23k19k16k11k09k05k01j97j94j91j87j84j80j77j73j70j66j64j59j57j53j50j47j44
39012C1650j40j38j34j31j28j26j22j20j16j14j11j09j05j03j01r8r5r3r1q8q6q4q1p9p8p5p3p1o9o8o6o3To0n9n8n6
39049B8198n4n3n2n1m9m8m7m6m5m4m3m2m1Tm0l9Tl8l7Tl6l7l5l6l5Wl4l5l4l5Vl6l5l6Tl7Ul8l9l8m0Um1m2Tm3m4Tm5
39105B5960m6m7Tm9m8n0n1Tn3Tn4Tn6n7Tn8o0To1To3To5To6o7o8Tp0Tp1p2Tp3p4p5Tp6p7p8p7p9Tq0Tq1Tq2Tq3Uq4Vq5X
39167B1663q6q5Uq6q5q4q5q4Uq3Uq2Tq1q0Up9p8p7p6Tp5p4p3p2p1p0o9o8o7o6o5o3o2o1o0n8n7n5Tn2n1n0m8m7m5m3m2
39219A7991m0l8l7l5l3l1l0k8k6k4k2k0j9j6j5j2j1qpnkjJMNQJ0J1J4J6J8K0K2K4K6K8L0L3L4L7L8M1M2M5M7M8N1N2N5
39268A8291N6N9O0O2O4O6O8P0P1P3P5P7P8Q0Q2Q4TQ7Q8R0R1R2R4R5R7R8R9J01J02J03J04J05J06J07J09TJ10J11J12T
$$ plain form
38954 45653 45318 44985 44655 44328 44004 43683 43365 43050 42738 42429 42123 41821 41521 41225 40932 40643 40357 40074 39795 39519 39247 38978 38712 38450 38192 37937 37686 37438 37194
38983 37194 36953 36716 36483 36253 36027 35804 35585 35369 35158 34949 34744 34543 34346 34152 33961 33774 33590 33410 33233 33060 32890 32724 32560 32401 32244 32091 31941 31794 31650
39012 31650 31510 31372 31238 31107 30979 30853 30731 30611 30495 30381 30270 30161 30056 29953 29852 29754 29659 29566 29475 29387 29301 29217 29136 29057 28979 28904 28831 28760 28691 28623 28557 28494 28431 28371 28312 28254 28198
39049 28198 28144 28091 28039 27988 27939 27891 27844 27798 27753 27709 27666 27624 27583 27542 27502 27463 27424 27386 27349 27312 27276 27239 27204 27168 27133 27098 27063 27028 26993 26959 26924 26890 26855 26820 26785 26750 26714 26679 26643 26607 26570 26533 26496 26458 26419 26381 26341 26301 26261 26220 26178 26136 26093 26049 26005 25960
39105 25960 25914 25867 25820 25771 25723 25673 25622 25571 25518 25465 25411 25357 25301 25244 25187 25129 25069 25009 24948 24887 24824 24761 24696 24631 24565 24498 24430 24362 24292 24222 24151 24079 24007 23934 23860 23785 23710 23634 23557 23479 23402 23323 23244 23164 23084 23003 22922 22840 22758 22675 22592 22509 22425 22341 22257 22173 22088 22003 21918 21833 21748 21663
39167 21663 21577 21492 21407 21322 21236 21151 21067 20982 20898 20814 20730 20647 20564 20481 20399 20317 20236 20156 20076 19996 19917 19839 19762 19686 19610 19535 19461 19388 19316 19245 19175 19106 19038 18971 18905 18840 18777 18715 18654 18594 18536 18479 18424 18369 18317 18266 18216 18168 18121 18076 18033 17991
39219 17991 17951 17913 17876 17841 17808 17777 17747 17719 17693 17669 17647 17627 17608 17592 17577 17565 17554 17546 17539 17534 17532 17531 17532 17536 17541 17549 17559 17570 17584 17600 17618 17638 17660 17684 17710 17738 17768 17801 17835 17872 17910 17951 17993 18038 18085 18133 18184 18236 18291
39268 18291 18347 18406 18466 18528 18592 18658 18726 18796 18867 18940 19015 19092 19170 19250 19332 19416 19500 19587 19675 19765 19856 19948 20042 20137 20234 20332 20431 20532 20634 20737 20841 20946 21052 21159 21268 21377 21487 21598 21710 21822
39308B1822J14UJ16UJ17TJ18TJ19J18J19VJ20J19VJ18J19J18TJ17TJ16TJ15TJ14J13J12TJ11J10J09J07TJ06J04TJ02
39352B6871J01J00R8R7R5R4R2R1Q9Q8Q6Q4Q3Q0P9P7P5P3P1O9O8O5O3O1N8N7N4N2N0M7M6M3M0L8L6L3L1K9K5K4K1J8J6
39395B9568J3J1QOL%knqj0j3j5j8k1k3k6k9l1l4l7l9m2m5m7m9n3n5n7o0o3o5o8p0p3p5p7q0q3q5q7r0r2r4r7r8j02j03
39442B7388j05j08j10j12j14j16j18j21j22j24j26j28j29j32j33j35j37j39j40j41j44Tj47j48j49j50j52j54Tj56j57
39473B3243j59Tj60j62Tj64j65Tj66j67j68j69Tj70j71Tj72Tj73j74j73j75j74j75Uj76j75j76Yj75j76j75Wj74j73
39517A5702j74j73j72Uj70j71j70j69j68Uj66Tj65j64Tj62Tj61j60j59j58Tj56j55Tj53j52j51Tj49j48j47j46j44T
39554I759j43j41j40j39j38j36Tj34j33j32j30j29j28j27j26j24j23j22j20j19j18j17j15j14j13j12j10j09j08j06
39584F017j05j04j03j01j00r9r8r6r5r4r3r1r0q9q8q6q5q4q3q2q1p9p8p7p6p5p3Tp1p0o9To7o5To4o3o2o0Tn9n7Tn6n5
$$ plain form
39308 21822 21936 22050 22164 22280 22396 22512 22629 22746 22864 22982 23101 23219 23338 23457 23576 23695 23815 23934 24053 24172 24291 24409 24528 24646 24764 24881 24998 25114 25230 25345 25460 25574 25687 25799 25911 26022 26132 26241 26348 26455 26561 26665 26769 26871
39352 26871 26972 27072 27170 27267 27362 27456 27548 27639 27728 27816 27902 27986 28069 28149 28228 28305 28380 28453 28524 28593 28661 28726 28789 28850 28908 28965 29019 29071 29121 29168 29214 29257 29297 29335 29371 29404 29435 29464 29489 29513 29534 29552 29568
39395 29568 29581 29592 29600 29606 29609 29609 29607 29602 29594 29584 29571 29556 29538 29517 29494 29468 29439 29408 29374 29337 29298 29256 29211 29164 29115 29062 29007 28950 28890 28827 28762 28694 28624 28551 28476 28399 28319 28236 28151 28064 27974 27882 27788 27691 27593 27491 27388
39442 27388 27283 27175 27065 26953 26839 26723 26605 26484 26362 26238 26112 25984 25855 25723 25590 25455 25318 25179 25039 24898 24754 24610 24463 24315 24166 24016 23864 23710 23556 23400 23243
39473 23243 23084 22925 22765 22603 22441 22277 22112 21947 21781 21614 21446 21277 21108 20938 20767 20596 20424 20252 20079 19905 19732 19557 19383 19208 19033 18858 18682 18507 18331 18155 17979 17803 17627 17451 17275 17100 16924 16749 16574 16399 16224 16049 15875 15702
39517 15702 15528 15355 15183 15011 14839 14669 14498 14328 14159 13991 13823 13655 13489 13323 13158 12994 12830 12668 12506 12345 12185 12026 11868 11710 11554 11399 11244 11091 10939 10788 10637 10488 10340 10193 10047 9903 9759
39554 9759 9616 9475 9335 9196 9058 8922 8786 8652 8519 8387 8257 8128 8000 7873 7747 7623 7500 7378 7258 7139 7021 6904 6789 6675 6562 6450 6340 6231 6123 6017
39584 6017 5912 5808 5705 5604 5504 5405 5307 5211 5116 5022 4929 4838 4748 4659 4571 4485 4400 4316 4233 4151 4070 3991 3913 3836 3760 3685 3612 3539 3468 3398 3329 3260 3193 3128 3063 2999 2936 2874 2814 2754 2695 2638 2581 2525 2470
39629B470n3Tn2n1n0Tm8m7Tm6m5m4m3m2Tm1m0l9l8Tl7l6Tl5l4l3Tl2l1Tl0Tk9k8Tk7k6Uk4k5k3k4k2k3k1k2k0k1j9k0
39680G09j9j8Uj7Tj6Uj5Tj4Vj3Tj2Vj1Uj0j1rj0rj0rqrqUpqpUopoVnonWmTnmVlmTlsklkTlkYjkTjkjkjTkjVkjW%jV%jU
$$ plain form
39629 2470 2417 2364 2312 2261 2211 2161 2113 2066 2019 1973 1928 1884 1841 1799 1757 1716 1676 1637 1599 1561 1524 1488 1452 1417 1383 1350 1317 1285 1254 1223 1193 1163 1134 1106 1078 1051 1025 999 973 949 924 901 877 855 832 811 789 769 748 729 709
39680 709 690 672 654 636 619 602 586 570 554 539 524 510 496 482 468 455 442 430 418 406 394 383 372 361 351 340 331 321 312 302 293 285 276 268 260 252 245 237 230 223 216 210 203 197 191 185 179 174 168 163 158 153 148 143 139 135 130 126 122 118 114 111 107 103 100 97 94 91 88 85 82 79 76 74 71 69 67 64 62 60 58 56 54 52 50 49 47 45 44 42 41 39 38 37 35 34 33 32 31 29 28 27 26 25 24 24 23 22 21 20 20 19 18 17
39794A7%j%jT%j%j%Tj%j%Tj%Tj%Tj%Uj%Vj%Wj%S0j%S5J%S0J%WJ%VJ%UJ%TJ%TJ%J%TJ%J%JT%JT%JT%JS2KJTKJKJKJKZLK
39939F5LKLYMLMXNMNVOTNOPOPVQPQRQRTJ0RJ0J1J0J1J2J1J2J3J2J3J4UJ5TJ6TJ7UJ8J9TK0TK1TK2K3TK4K5TK6K7K8TK9
40019I80L0TL1L3TL4L5TL7L8TM0M1TM3M4M5M6M7M9TN1N2N4N5N6N7N9O0O1O3O5O6O8O9P1P2P4P6P7Q0Q1Q2Q5Q7Q8R0R3
40067C691R4R6R9J00J03J05J07J09J12J13J17J18J21J23J26J28J31J34J36J39J41J44J47J50J52J55J59J61J64J67J70
40098G712J73J77J79J83J85J90J92J96J98K03K06K09K12K17K19K24K27K30K34K38K42K45K49K53K57K60K65K68K72K76
40128A4391K80K85K88K92K96L01L04L09L12L17L21L25L30L33L38L42L46L50L55L59L63L67L72L76L80L84L89L93L97
40157B4195M01M05M10M14M18M22M27M30M35M38M43M47M51M55M58M63M67M70M74M79M81M86M89M93M97N00N03N07N11
40186C7469N13N17N21N23N26N30N32N36N38N41N44N46N49N52N54N56N58N61N63N64N67N68N71TN74TN77TN78N80N81T
40218E5192N82N83TN84UN85N84UN83UN82N80TN79N77TN74N73N72N69N68N65N64N60N59N56N53N50N47N44N40N38N34
$$ plain form
39939 65 68 70 73 76 79 82 85 88 91 95 98 102 106 110 114 118 122 127 131 136 141 146 151 157 163 168 174 181 187 194 201 208 215 223 230 238 247 255 264 273 283 292 302 313 323 334 346 357 369 382 394 407 421 435 449 464 479 495 511 528 545 562 580 599 618 638 658 679 700 722 745 768 792 817 842 868 895 923 951 980
40019 980 1010 1040 1071 1104 1137 1171 1206 1241 1278 1316 1354 1394 1435 1476 1519 1563 1608 1654 1701 1750 1799 1850 1902 1956 2011 2067 2124 2183 2243 2304 2367 2432 2498 2566 2635 2706 2778 2852 2928 3005 3085 3166 3248 3333 3420 3508 3598 3691
40067 3691 3785 3881 3980 4080 4183 4288 4395 4504 4616 4729 4846 4964 5085 5208 5334 5462 5593 5727 5863 6002 6143 6287 6434 6584 6736 6891 7050 7211 7375 7542 7712
40098 7712 7885 8062 8241 8424 8609 8799 8991 9187 9385 9588 9794 10003 10215 10432 10651 10875 11102 11332 11566 11804 12046 12291 12540 12793 13050 13310 13575 13843 14115 14391
40128 14391 14671 14956 15244 15536 15832 16133 16437 16746 17058 17375 17696 18021 18351 18684 19022 19364 19710 20060 20415 20774 21137 21504 21876 22252 22632 23016 23405 23798 24195
40157 24195 24596 25001 25411 25825 26243 26665 27092 27522 27957 28395 28838 29285 29736 30191 30649 31112 31579 32049 32523 33002 33483 33969 34458 34951 35448 35948 36451 36958 37469
40186 37469 37982 38499 39020 39543 40069 40599 41131 41667 42205 42746 43290 43836 44385 44937 45491 46047 46605 47166 47729 48293 48860 49428 49999 50570 51144 51718 52295 52872 53450 54030 54611 55192
40218 55192 55774 56357 56940 57524 58108 58692 59277 59861 60445 61029 61612 62195 62778 63360 63940 64520 65099 65676 66253 66827 67400 67972 68541 69109 69674 70238 70798 71357 71913 72466 73016 73563 74107 74647 75185 75719
40254G5719N30N26N22N19N14N10N06N00M97M91M87M81M76M71M66M60M54M49M42M37M30M24M18M12M04L98L92L84L77
40283H9096L70L63L56L48L40L33L26L17L10L01K94K85K77K69K60K52K44K35K26K17K09K00J90J82J73J64J55J45J36
40312I6573J28J17J09R9R0Q0P1O1N2M3L3K4J4Mnj4k4l4m3n2o2p1q1r0j00j08j19j27j37j45j55j65j73j82j91k00k09
40349I5011k17k27k35k43k52k61k68k78k85k93l02l09l18l25l32l41l48l55l62l70l77l84l90l98m04m11m17m23m30
40378H5456m35m42m48m53m59m64m70m75m80m86m90m95m99n04n08n13n16n21n24n29n31n36n38n42n45n47n51n53n56
40407G0846n58n60n63n65n66n68n70n72Tn74n76Tn77n78Tn79Tn80Un79n80n79Tn78Tn77n76n75n74n73n71Tn68Tn65
40443E0204n64n62n60n57n56n54n51n49n46n44n41n39n36n33n30n27n23n21n18n14n11n08n04n01m97m94m90m86m83
40472C4905m78m75m71m67m63m60m55m51m47m42m39m35m30m26m22m17m13m09m05m00l96l91l87l83l78l74l70l65l60
$$ plain form
40254 75719 76249 76775 77297 77816 78330 78840 79346 79846 80343 80834 81321 81802 82278 82749 83215 83675 84129 84578 85020 85457 85887 86311 86729 87141 87545 87943 88335 88719 89096
40283 89096 89466 89829 90185 90533 90873 91206 91532 91849 92159 92460 92754 93039 93316 93585 93845 94097 94341 94576 94802 95019 95228 95428 95618 95800 95973 96137 96292 96437 96573
40312 96573 96701 96818 96927 97026 97116 97196 97267 97328 97380 97423 97456 97480 97494 97498 97493 97479 97455 97421 97378 97326 97264 97193 97112 97022 96922 96814 96695 96568 96431 96286 96131 95966 95793 95611 95420 95220 95011
40349 95011 94794 94567 94332 94089 93837 93576 93308 93030 92745 92452 92150 91841 91523 91198 90866 90525 90177 89822 89460 89090 88713 88329 87939 87541 87137 86726 86309 85886 85456
40378 85456 85021 84579 84131 83678 83219 82755 82285 81810 81330 80844 80354 79859 79360 78856 78348 77835 77319 76798 76274 75745 75214 74678 74140 73598 73053 72506 71955 71402 70846
40407 70846 70288 69728 69165 68600 68034 67466 66896 66324 65752 65178 64602 64026 63449 62871 62293 61714 61135 60555 59975 59395 58816 58236 57657 57078 56500 55922 55345 54769 54194 53620 53047 52476 51905 51337 50769 50204
40443 50204 49640 49078 48518 47961 47405 46851 46300 45751 45205 44661 44120 43581 43045 42512 41982 41455 40932 40411 39893 39379 38868 38360 37856 37355 36858 36364 35874 35388 34905
40472 34905 34427 33952 33481 33014 32551 32091 31636 31185 30738 30296 29857 29422 28992 28566 28144 27727 27314 26905 26500 26100 25704 25313 24926 24543 24165 23791 23421 23056 22696
40501B2696l57l51l48l43l38l35l29l26l21l16l13l07l04k99k95k91k86k82k78k74k69k66k61k57k53k49k44k41k37
40530A4126k33k29k25k21k17k13k10k06k02j98j95j91j88j84j80j77j74j70j67j63j60j57j53j51j47j44j41j38j35
40559H857j32j30j26j23j21j18j15j12j10j07j05j02r9r7r5r2r0q8q5q3q1p9p7p5p2p1o8o7o5o3o1o0n7n6n5n2n1n0m8
40598E519m6m5m4m2m0Tl8l7l5Tl3l2l1l0k9k7Tk6k5k3Uk1k0Tj9j8j7Tj6Tj4j5j3Uj2j1Uj0rj0rqVpUoVnonVmnmTnmWlmV
40674D304lmWlmXnmUnmTnmnTmnUmnS0onZmnUmnmTnmVlmlWkWjU%j%TJUKJKLUMUNUOPOQPRQRJ0TJ1UJ2J3TJ4TJ5TJ6TJ7
40792D295J8UK0J9K1TK2TK3TK4K5TK6TK8K7K9UL1L0L2TL3TL4L5TL6TL7L8TL9M0TM1TM2TM3M4TM5TM6TM7M8UM9N0UN1T
40851F358N2TN3TN4UN5UN6UN7UN8N7N9N8TN9WO0N9O0UN9O0XN9O0TN9TO0N9N8N9TN8TN7N8N7TN6UN5UN4TN3TN2TN1N0U
40921A0326M9M8TM7M6TM5M4M3TM2TM0TL9L8L7TL6L4TL3L2L1TK9K8TK6TK4TK2TK1J9TJ7J6TJ4J3J2J1J0RQPOMTKJ%jklm
$$ plain form
40501 22696 22339 21988 21640 21297 20959 20624 20295 19969 19648 19332 19019 18712 18408 18109 17814 17523 17237 16955 16677 16403 16134 15868 15607 15350 15097 14848 14604 14363 14126
40530 14126 13893 13664 13439 13218 13001 12788 12578 12372 12170 11972 11777 11586 11398 11214 11034 10857 10683 10513 10346 10183 10023 9866 9713 9562 9415 9271 9130 8992 8857
40559 8857 8725 8595 8469 8346 8225 8107 7992 7880 7770 7663 7558 7456 7357 7260 7165 7073 6983 6895 6810 6727 6646 6567 6490 6415 6343 6272 6204 6137 6072 6009 5948 5888 5831 5775 5720 5668 5617 5567 5519
40598 5519 5473 5428 5384 5342 5302 5262 5224 5187 5152 5117 5084 5052 5021 4991 4962 4935 4908 4882 4857 4834 4811 4788 4767 4747 4727 4708 4690 4673 4656 4640 4624 4610 4595 4582 4569 4556 4544 4533 4522 4511 4501 4492 4482 4473 4465 4457 4449 4441 4434 4427 4420 4414 4408 4402 4396 4391 4385 4380 4375 4370 4365 4361 4356 4352 4348 4343 4339 4335 4331 4327 4323 4320 4316 4312 4308 4304
40674 4304 4301 4297 4293 4289 4285 4281 4278 4274 4270 4266 4262 4258 4254 4249 4245 4241 4237 4232 4228 4224 4219 4215 4210 4205 4201 4196 4191 4186 4182 4177 4172 4167 4162 4157 4152 4147 4142 4137 4132 4126 4121 4116 4111 4106 4101 4096 4091 4086 4082 4077 4072 4067 4063 4058 4054 4050 4045 4041 4037 4033 4029 4026 4022 4019 4016 4013 4010 4007 4005 4003 4001 3999 3997 3996 3995 3994 3994 3993 3993 3993 3994 3995 3996 3998 3999 4001 4004 4007 4010 4014 4018 4022 4027 4032 4037 4043 4050 4056 4064 4071 4080 4088 4097 4107 4117 4128 4139 4150 4162 4175 4188 4202 4216 4231 4246 4262 4278 4295
40792 4295 4313 4331 4349 4369 4388 4409 4430 4452 4474 4497 4520 4544 4569 4594 4620 4646 4674 4701 4730 4759 4788 4819 4849 4881 4913 4946 4979 5013 5048 5083 5119 5155 5192 5230 5268 5307 5347 5387 5428 5469 5511 5553 5596 5640 5684 5729 5774 5820 5866 5913 5961 6009 6057 6106 6156 6206 6256 6307 6358
40851 6358 6410 6462 6515 6568 6622 6676 6730 6785 6840 6895 6951 7007 7063 7120 7177 7234 7292 7349 7408 7466 7524 7583 7642 7701 7760 7819 7879 7938 7998 8058 8118 8177 8237 8297 8357 8417 8477 8537 8596 8656 8716 8775 8834 8894 8953 9011 9070 9129 9187 9245 9302 9360 9417 9474 9530 9586 9642 9697 9752 9807 9861 9915 9968 10021 10073 10125 10176 10226 10276 10326
40921 10326 10375 10423 10471 10518 10564 10610 10655 10699 10742 10785 10827 10869 10909 10949 10988 11026 11063 11100 11136 11170 11204 11237 11269 11300 11331 11360 11388 11416 11442 11468 11492 11516 11538 11560 11581 11600 11619 11636 11652 11668 11682 11695 11707 11718 11728 11737 11745 11752 11758 11762 11766 11768 11769 11769 11768 11766 11763 11759
40979A1759oTqTj0j1j2j3j4j6Tj8Tk0Tk2k3k4k5k6k7k8k9l0l1l2l3l4l5l6l7l8l9Tm1m2Tm3m4m6m5m7m8Tm9n0n1Tn2n3
41029A0223n4Tn5Tn7Un8n9o0Uo1o2Uo3o4Uo5To6Uo7Vo8To9o8o9Up0o9p0Zp1p0Tp1p0Zo9p0o9Vo8o9o8To7o8o7To6o7o5
41104E263o6o5o6o4o5o4o3Vo2To1To0Un9Tn8Un7n6Un5Tn4n3n4n2Un1Tn0Tm9Tm8Tm7m6m7m5Um4Tm3m2Um1Tm0l9Ul8l7U
41168A935l6l5l6l4Ul3Tl2Tl1Tl0Tk9Uk8Tk7Tk6Tk5k6k4k5k3k4k3Tk2Tk1k2k0k1k0j9k0j9j8j9j8j7j8j6j7j6Vj5j4j5
$$ plain form
40979 11759 11753 11747 11739 11731 11721 11710 11698 11685 11671 11655 11639 11621 11603 11583 11563 11541 11518 11494 11469 11443 11416 11388 11359 11329 11298 11266 11233 11199 11164 11128 11091 11053 11014 10975 10934 10892 10850 10807 10763 10717 10672 10625 10577 10529 10480 10430 10379 10328 10276 10223
41029 10223 10169 10115 10060 10005 9948 9891 9834 9776 9717 9657 9597 9537 9476 9414 9352 9290 9227 9163 9099 9035 8970 8905 8839 8773 8707 8640 8573 8506 8439 8371 8303 8234 8166 8097 8028 7959 7889 7820 7750 7680 7610 7540 7470 7400 7330 7260 7189 7119 7049 6978 6908 6838 6768 6698 6628 6558 6488 6418 6349 6279 6210 6141 6072 6003 5935 5866 5798 5730 5663 5595 5528 5461 5395 5328 5263
41104 5263 5197 5132 5066 5002 4937 4873 4810 4747 4684 4621 4559 4497 4436 4375 4315 4255 4195 4136 4077 4019 3961 3903 3846 3790 3734 3678 3623 3568 3514 3461 3407 3355 3303 3251 3200 3149 3099 3049 3000 2951 2903 2855 2808 2762 2715 2670 2625 2580 2536 2492 2449 2407 2365 2323 2282 2241 2201 2162 2123 2084 2046 2009 1972 1935
41168 1935 1899 1864 1828 1794 1760 1726 1693 1660 1628 1596 1565 1534 1504 1474 1445 1416 1387 1359 1331 1304 1277 1251 1225 1200 1174 1150 1125 1102 1078 1055 1032 1010 988 967 945 925 904 884 865 845 826 808 789 771 754 736 720 703 687 671 655 639 624 610 595
41223E95j4Uj3Vj2Uj1j2j1Tj0j1j0Trj0rVqrqTpqpXoXnonWmnmnmVlmTlTmlXklTklkUlkWjkUjkjkjkjTkjS5%jU%jT%j%j
41345A5%j%j%j%j%Tj%j%Tj%Uj%Tj%Vj%Vj%Wj%Zj%S1j%T4j%Y06J%T7J%S3J%sJ%XJ%WJ%VJ%UJ%UJ%TJ%TJ%TJ%TJ%J%TJ%J
42234A6%J%J%JT%J%JT%JU%JV%JS1KJVKJTKJKJKJKJKUJKS1LKTLKLKLTKLsMLMLMLMLMYNMTNMNTMNWONTONOTNOWPOPOPOPY
42371D23QPQPQZRQRQRZJ0RJ0RJ0TRJ0WJ1J0TJ1J0J1J0J1UJ0J1WJ2J1UJ2J1TJ2J1J2J1J2J1J2J1J2TJ1J2TJ1J2UJ1J2T
42450A223J1J2TJ1J2TJ1J2J1J2J1J2J1J2J1UJ2J1XJ0J1TJ0J1J0UJ1J0TRJ0TRJ0RYQRQVPQPQPUOPOWNONVMNMULMLVKLKU
42539A946JKJU%J%Vj%jTkjkjklklklTmlmWnTmonTonoTpopopVqpqWrqrYj0rj0Urj1j0Uj1j0j1j0j1Uj0j1Tj2j1Vj2j1j2
42634A360j1Tj2Tj1j2j1j2Tj1j2Tj1j2Tj1j2Uj1j2Tj1j2j1j2Tj1j2j1j2j1Tj2j1Tj2j1Zj0j1Tj0j1j0j1j0Tj1j0Xrj0r
$$ plain form
42371 423 431 438 446 453 461 469 477 485 493 501 509 517 526 534 543 551 560 569 578 587 596 605 614 623 633 642 652 661 671 681 690 700 710 720 730 740 751 761 771 782 792 803 813 824 835 846 856 867 878 889 900 911 923 934 945 956 968 979 990 1002 1013 1025 1036 1048 1059 1071 1082 1094 1106 1117 1129 1141 1152 1164 1176 1188 1199 1211 1223
42450 1223 1234 1246 1258 1269 1281 1293 1304 1316 1327 1339 1350 1362 1373 1385 1396 1407 1418 1430 1441 1452 1463 1474 1485 1496 1506 1517 1528 1538 1549 1559 1569 1579 1590 1600 1610 1619 1629 1639 1648 1658 1667 1676 1685 1694 1703 1712 1721 1729 1738 1746 1754 1762 1770 1777 1785 1792 1800 1807 1814 1821 1827 1834 1840 1846 1852 1858 1864 1869 1875 1880 1885 1890 1895 1899 1904 1908 1912 1916 1919 1923 1926 1929 1932 1935 1937 1940 1942 1944 1946
42539 1946 1947 1949 1950 1951 1952 1952 1953 1953 1953 1953 1953 1952 1952 1951 1950 1948 1947 1945 1944 1942 1939 1937 1934 1932 1929 1926 1922 1919 1915 1911 1907 1903 1899 1894 1889 1885 1879 1874 1869 1863 1858 1852 1846 1839 1833 1826 1820 1813 1806 1799 1792 1784 1777 1769 1761 1753 1745 1737 1728 1720 1711 1702 1693 1684 1675 1666 1657 1647 1638 1628 1618 1608 1599 1588 1578 1568 1558 1547 1537 1526 1516 1505 1494 1483 1473 1462 1451 1439 1428 1417 1406 1395 1383 1372 1360
42634 1360 1349 1338 1326 1314 1303 1291 1280 1268 1256 1245 1233 1221 1210 1198 1186 1175 1163 1151 1139 1128 1116 1104 1093 1081 1070 1058 1046 1035 1023 1012 1000 989 978 966 955 944 932 921 910 899 888 877 866 855 844 834 823 812 802 791 781 770 760 750 739 729 719 709 699 689 679 670 660 651
42698F51j0rj0rZqrqrqYpqTpTqpWopToposnononZmnTmTnmslmlmlmlS1klklklklkS3jkTjkTjkjTkjTkjUkjS3%jU%jU%jT
42852B1%j%jT%j%j%j%j%Tj%j%Tj%Tj%Tj%Tj%Uj%Uj%Vj%Wj%Xj%sj%S3j%T7j%W150J%T0J%ZJ%XJ%VJ%UJ%UJ%J%TJ%J%J%J
48172A2%J%JT%JX%KJWKJKJKJKYLKLKLWMLMVNMNUONOUPVQTRQRJ0RJ1J0J1J2UJ3TJ4TJ5J6UJ8UK0TK1K2TK3K5TK6K7K8K9
48269G68L0L1L2L4TL6L8TM0M1M3M5M6M7M9N1N3N4N7N8O1O2O4O7O9P2P3P7P9Q1Q4Q7R0R3R6R9J02J06J09J12J16J20J24
48312C668J28J31J36J41J44J49J54J59J64J68J74J79J85J90J96K02K08K15K20K28K34K41K48K56K63K70K79K86K95L03
48342I814L12L21L30L39L49L59L69L79L89M00M12M22M34M46M58M70M83M96N09N23N36N50N65N80N94O10O26O42O58O75
48372B4050O92P09P27P45P64P83Q02Q21Q42Q62Q83R04R25R48R70R93J017J040J064J089J114J140J166J192J219J246
48398D8707J274J303J331J361J390J421J451J483J514J547J579J613J647J681J716J751J787J823J861J898J936J974
48420H4048K014K053K093K135K175K217K260K302K346K390K434K480K525K571K618K665K712K761K810K859K909K960
48442A38337L010L062L113L166L219L273L326L380L436L491L546L603L660L717L774L832L891L950M009M068M129M189
$$ plain form
48172 12 12 13 13 14 15 15 16 17 18 19 20 21 21 23 24 25 26 27 28 30 31 33 34 36 37 39 41 43 45 47 49 51 54 56 59 61 64 67 70 73 76 80 83 87 91 95 99 104 108 113 118 123 129 134 140 146 152 159 166 173 180 188 196 205 213 222 232 241 252 262 273 285 297 309 322 335 349 363 378 394 410 426 444 462 480 500 520 541 563 585 608 633 658 684 711 739 768
48269 768 798 829 861 895 929 965 1003 1041 1081 1122 1165 1210 1256 1303 1352 1403 1456 1510 1567 1625 1686 1748 1812 1879 1948 2020 2093 2170 2249 2330 2414 2501 2591 2684 2780 2879 2981 3087 3196 3308 3424 3544 3668
48312 3668 3796 3927 4063 4204 4348 4497 4651 4810 4974 5142 5316 5495 5680 5870 6066 6268 6476 6691 6911 7139 7373 7614 7862 8118 8381 8651 8930 9216 9511 9814
48342 9814 10126 10447 10777 11116 11465 11824 12193 12572 12961 13361 13773 14195 14629 15075 15533 16003 16486 16982 17491 18014 18550 19100 19665 20245 20839 21449 22075 22717 23375 24050
48372 24050 24742 25451 26178 26923 27687 28470 29272 30093 30935 31797 32680 33584 34509 35457 36427 37420 38437 39477 40541 41630 42744 43884 45050 46242 47461 48707
48398 48707 49981 51284 52615 53976 55366 56787 58238 59721 61235 62782 64361 65974 67621 69302 71018 72769 74556 76379 78240 80138 82074 84048
48420 84048 86062 88115 90208 92343 94518 96735 98995 101297 103643 106033 108467 110947 113472 116043 118661 121326 124038 126799 129609 132468 135377 138337
48442 138337 141347 144409 147522 150688 153907 157180 160506 163886 167322 170813 174359 177962 181622 185339 189113 192945 196836 200786 204795 208863 212992 217181
48464B17181M249M311M372M435M496M558M622M684M747M811M875M938N003N067N132N196N261N326N392N456N521N587
48486C25220N652N718N783N848N914N979O044O109O174O239O304O368O432O496O561O623O687O750O813O875O936O998
48508D64523P059P120P180P239P298P356P414P472P528P584P639P694P748P800P853P904P955Q004Q053Q101Q147Q194
48530F32865Q238Q282Q325Q367Q407Q447Q485Q521Q558Q593Q625Q658Q689Q717Q746Q773Q797Q822Q844Q864Q884Q902
48552H22409Q917Q933Q946Q956Q967Q975Q981Q987Q989Q990TQ988Q984Q978Q970Q961Q950Q936Q922Q904Q886Q865
48574A019384Q842Q818Q791Q763Q733Q700Q665Q630Q591Q550Q509Q464Q418Q369Q320Q267Q212Q157Q098Q038P976
48595A197295P911P846P777P707P635P561P485P407P327P246P162P077O989O901O809O717O621O526O428O327O227
48616A346981O122O019N911N803N694N582N470N355N239N122N003M882M762M638M514M389M262M134M005L875L743
$$ plain form
48464 217181 221430 225741 230113 234548 239044 243602 248224 252908 257655 262466 267341 272279 277282 282349 287481 292677 297938 303264 308656 314112 319633 325220
48486 325220 330872 336590 342373 348221 354135 360114 366158 372267 378441 384680 390984 397352 403784 410280 416841 423464 430151 436901 443714 450589 457525 464523
48508 464523 471582 478702 485882 493121 500419 507775 515189 522661 530189 537773 545412 553106 560854 568654 576507 584411 592366 600370 608423 616524 624671 632865
48530 632865 641103 649385 657710 666077 674484 682931 691416 699937 708495 717088 725713 734371 743060 751777 760523 769296 778093 786915 795759 804623 813507 822409
48552 822409 831326 840259 849205 858161 867128 876103 885084 894071 903060 912050 921040 930028 939012 947990 956960 965921 974871 983807 992729 1001633 1010519 1019384
48574 1019384 1028226 1037044 1045835 1054598 1063331 1072031 1080696 1089326 1097917 1106467 1114976 1123440 1131858 1140227 1148547 1156814 1165026 1173183 1181281 1189319 1197295
48595 1197295 1205206 1213052 1220829 1228536 1236171 1243732 1251217 1258624 1265951 1273197 1280359 1287436 1294425 1301326 1308135 1314852 1321473 1327999 1334427 1340754 1346981
48616 1346981 1353103 1359122 1365033 1370836 1376530 1382112 1387582 1392937 1398176 1403298 1408301 1413183 1417945 1422583 1427097 1431486 1435748 1439882 1443887 1447762 1451505
48637A451505L611L478L343L208L071K934K796K657K517K377K236K095J952J809J665J522J377J233J087R42P96O50
48659A498861N05L57K12O5q2k28l74n21o66q13r58j104j249j394j537j682j825j968k111k251k393k534k672k812k949
48684A467877l087l223l358l493l626l758l890m019m149m276m403m529m652m775m896n017n135n252n368n482n595
48705A375894n706n816n924o029o135o238o339o439o536o633o727o820o910o999p087p171p255p337p416p494p569
48726A235314p643p715p785p853p919p983q045q105q163q219q273q325q375q423q469q513q556q595q634q669q704
48747A062348q736q766q794q821q845q868q888q906q923q938q951q963q971q979q984q988q990q991q989q985q981
48768H75091q974q966q955q945q930q917q899q882q862q842q818q795q770q743q714q685q655q622q588q554q518q480
48790F81977q443q402q362q320q278q233q188q143q095q048p998p949p899p847p794p742p687p633p578p522p465p408
$$ plain form
48637 1451505 1455116 1458594 1461937 1465145 1468216 1471150 1473946 1476603 1479120 1481497 1483733 1485828 1487780 1489589 1491254 1492776 1494153 1495386 1496473 1497415 1498211 1498861
48659 1498861 1499366 1499723 1499935 1500000 1499918 1499690 1499316 1498795 1498129 1497316 1496358 1495254 1494005 1492611 1491074 1489392 1487567 1485599 1483488 1481237 1478844 1476310 1473638 1470826 1467877
48684 1467877 1464790 1461567 1458209 1454716 1451090 1447332 1443442 1439423 1435274 1430998 1426595 1422066 1417414 1412639 1407743 1402726 1397591 1392339 1386971 1381489 1375894
48705 1375894 1370188 1364372 1358448 1352419 1346284 1340046 1333707 1327268 1320732 1314099 1307372 1300552 1293642 1286643 1279556 1272385 1265130 1257793 1250377 1242883 1235314
48726 1235314 1227671 1219956 1212171 1204318 1196399 1188416 1180371 1172266 1164103 1155884 1147611 1139286 1130911 1122488 1114019 1105506 1096950 1088355 1079721 1071052 1062348
48747 1062348 1053612 1044846 1036052 1027231 1018386 1009518 1000630 991724 982801 973863 964912 955949 946978 937999 929015 920027 911037 902046 893057 884072 875091
48768 875091 866117 857151 848196 839251 830321 821404 812505 803623 794761 785919 777101 768306 759536 750793 742079 733394 724739 716117 707529 698975 690457 681977
48790 681977 673534 665132 656770 648450 640172 631939 623751 615608 607513 599465 591467 583518 575619 567772 559978 552236 544549 536916 529338 521816 514351 506943
48812E06943p350p291p233p173p112p052o992o929o868o806o742o680o617o553o489o425o361o297o231o167o102o036
48834C59437n972n906n841n776n710n645n579n514n449n384n319n254n189n124n060m996m931m867m804m740m678m614
48856B43085m551m489m427m366m304m243m182m121m062m002l943l885l825l768l711l653l596l540l485l429l375l320
48878A56808l266l213l160l108l056l004k954k903k854k804k756k707k660k612k566k520k474k430k384k341k298k255
48900I6483k212k171k130k088k049k009j971j931j894j856j819j783j748j711j677j643j609j576j543j511j479j448
48922E6625j417j387j357j329j299j271j243j216j189j163j136j112j086j061j038j014r90r68r45r23r02q81q59q39
48946C0000q20p99p81p62p43p25p07o90o73o56o40o24o08n93n78n63n49n35n21n07m95m81m69m57m44m33m21m10l99
48975A2917l89l77l68l58l47l39l29l19l11l03k94k85k78k70k62k54k48k40k33k27k20k13k08k01j96j89j84j79j73
$$ plain form
48812 506943 499593 492302 485069 477896 470784 463732 456740 449811 442943 436137 429395 422715 416098 409545 403056 396631 390270 383973 377742 371575 365473 359437
48834 359437 353465 347559 341718 335942 330232 324587 319008 313494 308045 302661 297342 292088 286899 281775 276715 271719 266788 261921 257117 252377 247699 243085
48856 243085 238534 234045 229618 225252 220948 216705 212523 208402 204340 200338 196395 192510 188685 184917 181206 177553 173957 170417 166932 163503 160128 156808
48878 156808 153542 150329 147169 144061 141005 138001 135047 132144 129290 126486 123730 121023 118363 115751 113185 110665 108191 105761 103377 101036 98738 96483
48900 96483 94271 92100 89970 87882 85833 83824 81853 79922 78028 76172 74353 72570 70822 69111 67434 65791 64182 62606 61063 59552 58073 56625
48922 56625 55208 53821 52464 51135 49836 48565 47322 46106 44917 43754 42618 41506 40420 39359 38321 37307 36317 35349 34404 33481 32579 31698 30839 30000
48946 30000 29180 28381 27600 26838 26095 25370 24663 23973 23300 22644 22004 21380 20772 20179 19601 19038 18489 17954 17433 16926 16431 15950 15481 15024 14580 14147 13726 13316 12917
48975 12917 12528 12151 11783 11425 11078 10739 10410 10091 9780 9477 9183 8898 8620 8350 8088 7834 7586 7346 7113 6886 6666 6453 6245 6044 5848 5659 5475 5296 5123
49004E123j68j63j58j54j48j44j40j36j31j27j23j20j16j12j08j06j02r8r6r2r0q6q4q1p9p6p3p2o8o7o4o2o1n8n6n4
49040A450n3n0m9m8m5Tm2m1m0l9l7l6l4l3Tl1l0k8Tk7k6k5k4k3Tk1Tk0Tj8Tj7Tj6Tj4j5j4j3Tj2Tj1Uj0rj0rqrqpqpTo
$$ plain form
49004 5123 4955 4792 4634 4480 4332 4188 4048 3912 3781 3654 3531 3411 3295 3183 3075 2969 2867 2769 2673 2581 2491 2405 2321 2240 2161 2085 2012 1940 1872 1805 1741 1679 1618 1560 1504 1450
49040 1450 1397 1347 1298 1250 1205 1160 1118 1077 1037 998 961 925 891 858 825 794 764 736 708 681 655 630 606 583 560 539 518 498 478 460 442 425 408 392 376 362 347 333 320 307 295 283 272 261 250 240 231 221 212 204 195 187 180 172 165 158 152
49097A52ponononmnmXlYklkZjkTjTkjUkjV%jV%jT%j%jT%Tj%j%j%Tj%Uj%Uj%Vj%Wj%sj%T0j%W0883J%V1J%T1J%S6J%S1J
100193E%S0J%sJ%ZJ%YJ%XJ%XJ%XJ%XJ%WJ%WJ%WJ%WJ%WJ%WJ%XJ%WJ%WJ%XJ%XJ%YJ%ZJ%S0J%S7J%T4j%S7j%S0j%Zj%Yj%X
100451B3j%Xj%Wj%Wj%Wj%Xj%Wj%Wj%Wj%Wj%Wj%Xj%Wj%Yj%Xj%Yj%Zj%Zj%S0j%S2j%S5j%T2j%V1j%U02J%U8J%S9J%S3J%S0
101059DJ%ZJ%YJ%XJ%WJ%WJ%WJ%VJ%UJ%VJ%UJ%UJ%UJ%UJ%UJ%UJ%TJ%TJ%UJ%TJ%TJ%TJ%TJ%UJ%TJ%TJ%J%TJ%TJ%TJ%TJ%T
101188C5J%TJ%TJ%TJ%J%TJ%TJ%TJ%TJ%TJ%TJ%TJ%TJ%TJ%TJ%TJ%TJ%TJ%TJ%TJ%TJ%TJ%TJ%J%TJ%TJ%J%TJ%J%J%J%J%J%JT
101280G0%J%JT%JV%JYKJUKJTKJKTJKXLKTLTKLVMLMTLMNMTNWOVPOPTQVRQJ0RJ0TJ1UJ2TJ3UJ4TJ5J6J5J7UJ8J9TK0K1T
101380F78K2TK4TK5TK7TK8K9L0L1L2TL4L5L6L7L8L9M0M2TM5TM7M8M9N1N2N4N5N7N9O0O2O4O5O7O9P1P3P5P7P9Q2Q3Q6
101428B974Q8R0R2R5R8J00J03J05J08J11J13J17J19J23J25J29J32J35J38J42J45J49J52J56J60J64J67J71J76J79J84
101459G040J88J92J96K01K06K10K15K19K25K29K35K39K45K50K56K60K67K72K78K83K90K95L01L08L14L20L27L33L39
101488A4533L47L53L60L67L74L81L89L96M03M11M18M26M34M41M50M58M66M74M82M91N00N08N16N26N34N43N52N62N70
101517B7665N80N89N98O08O18O27O37O47O56O67O77O86O97P07P17P28P37P49P59P69P80P90Q02Q11Q23Q34Q44Q55Q66
101546D8523Q77Q88Q99R10R21R32R42R54R65R76R87R98J010J020J031J042J053J064J074J086J096J108J118J128J139
$$ plain form
101188 35 36 36 36 37 37 37 38 38 38 39 39 40 40 40 41 41 41 42 42 42 43 43 43 44 44 44 45 45 45 46 46 46 47 47 47 48 48 48 49 49 49 50 50 50 51 51 51 52 52 52 53 53 53 54 54 54 55 55 55 56 56 56 57 57 57 58 58 59 59 59 60 60 60 61 61 62 62 62 63 63 64 64 65 65 66 66 67 67 68 68 69 70
101280 70 70 71 71 72 73 73 74 75 76 77 77 78 79 80 81 82 83 84 86 87 88 89 91 92 93 95 96 98 100 101 103 105 107 109 111 113 116 118 120 123 126 128 131 134 137 140 144 147 151 155 158 162 167 171 175 180 185 190 195 200 206 212 218 224 231 237 244 251 259 267 275 283 292 300 310 319 329 339 350 361 372 384 396 409 422 435 449 463 478 494 509 526 543 560 578 597 616 636 657 678
101380 678 700 722 746 770 795 820 847 874 902 931 961 992 1024 1056 1090 1125 1161 1198 1236 1275 1315 1357 1399 1444 1489 1536 1584 1633 1684 1736 1790 1845 1902 1961 2021 2083 2147 2212 2279 2348 2419 2492 2567 2644 2723 2805 2888 2974
101428 2974 3062 3152 3244 3339 3437 3537 3640 3745 3853 3964 4077 4194 4313 4436 4561 4690 4822 4957 5095 5237 5382 5531 5683 5839 5999 6163 6330 6501 6677 6856 7040
101459 7040 7228 7420 7616 7817 8023 8233 8448 8667 8892 9121 9356 9595 9840 10090 10346 10606 10873 11145 11423 11706 11996 12291 12592 12900 13214 13534 13861 14194 14533
101488 14533 14880 15233 15593 15960 16334 16715 17104 17500 17903 18314 18732 19158 19592 20033 20483 20941 21407 21881 22363 22854 23354 23862 24378 24904 25438 25981 26533 27095 27665
101517 27665 28245 28834 29432 30040 30658 31285 31922 32569 33225 33892 34569 35255 35952 36659 37376 38104 38841 39590 40349 41118 41898 42688 43490 44301 45124 45958 46802 47657 48523
101546 48523 49400 50288 51187 52097 53018 53950 54892 55846 56811 57787 58774 59772 60782 61802 62833 63875 64928 65992 67066 68152 69248 70356 71474 72602 73741
101571G3741J150J160J171J181J192J201J212J222J232J241J252J261J270J280J289J299J308J316J326J334J342J351
101593A01331J359J367J376J382J391J398J405J412J419J426J432J438J444J450J456J462J466J471J476J481J485
101614A31327J489J492J497J499J502J506J507J510J512J513J515J516TJ518J517VJ515J514J512J511J508J506J503
101639A69056J500J496J492J488J484J479J474J468J463J457J450J443J436J428J421J413J404J395J386J377J367
101660A99377J356J347J335J324J313J300J289J276J263J251J236J223J209J195J179J165J149J134J117J102J085
101681B25225J068J050J034J016R97R80R61R42R23R04Q84Q65Q44Q24Q04P83P62P40P20O97O76O54O32O10N87N64N41
101708B47287N19M95M72M48M25M01L78L53L30L05K81K57K32K08J84J59J34J10Q5O0L6J1j4l8o3q8j13j37j62j86k11
101739B52158k35k60k83l08l33l56l80m04m27m51m75m98n21n44n66n90o12o34o57o78p00p22p43p65p85q06q26q47q66
$$ plain form
101571 73741 74891 76051 77222 78403 79595 80796 82008 83230 84462 85703 86955 88216 89486 90766 92055 93354 94662 95978 97304 98638 99980 101331
101593 101331 102690 104057 105433 106815 108206 109604 111009 112421 113840 115266 116698 118136 119580 121030 122486 123948 125414 126885 128361 129842 131327
101614 131327 132816 134308 135805 137304 138806 140312 141819 143329 144841 146354 147869 149385 150901 152419 153936 155453 156970 158487 160002 161516 163028 164539 166047 167553 169056
101639 169056 170556 172052 173544 175032 176516 177995 179469 180937 182400 183857 185307 186750 188186 189614 191035 192448 193852 195247 196633 198010 199377
101660 199377 200733 202080 203415 204739 206052 207352 208641 209917 211180 212431 213667 214890 216099 217294 218473 219638 220787 221921 223038 224140 225225
101681 225225 226293 227343 228377 229393 230390 231370 232331 233273 234196 235100 235984 236849 237693 238517 239321 240104 240866 241606 242326 243023 243699 244353 244985 245595 246182 246746 247287
101708 247287 247806 248301 248773 249221 249646 250047 250425 250778 251108 251413 251694 251951 252183 252391 252575 252734 252868 252978 253063 253123 253159 253170 253156 253118 253055 252967 252854 252717 252555 252369 252158
101739 252158 251923 251663 251380 251072 250739 250383 250003 249599 249172 248721 248246 247748 247227 246683 246117 245527 244915 244281 243624 242946 242246 241524 240781 240016 239231 238425 237599 236752 235886
101768B35886q87r06r25r45r63r81j000j018j035j053j070j087j103j119j136j151j166j181j196j211j224j239j251
101791B11039j265j278j290j302j314j325j337j347j358j368j378j387j396j405j414j421j430j437j444j450j458
101812A82235j463j469j474j480j484j489j493j496j501j503j506j508j511j513j514j515j517Uj518j517j516Tj515
101836A46183j513j512j509j507j505j502j499j496j492j489j484j480j476j471j466j460j456j449j444j438j431
101857A15104j425j418j411j405j397j389j382j375j366j358j350j342j333j324j316j307j297j288j279j270j260
101878H6812j250j241j230j221j211j200j190j180j170j159j149j138j127j117j106j095j085j073j063j052j041j029
101900F1685j019j008r97r86r75r63r53r42r31r19r09q98q86q76q65q54q43q32q22q11q00p89p79p68p58p47p37p26
101928C7292p16p06o96o86o75o66o55o46o36o26o17o07n97n88n79n70n60n51n42n34n24n16n07m99m90m81m74m65m57
$$ plain form
101768 235886 234999 234093 233168 232223 231260 230279 229279 228261 227226 226173 225103 224016 222913 221794 220658 219507 218341 217160 215964 214753 213529 212290 211039
101791 211039 209774 208496 207206 205904 204590 203265 201928 200581 199223 197855 196477 195090 193694 192289 190875 189454 188024 186587 185143 183693 182235
101812 182235 180772 179303 177829 176349 174865 173376 171883 170387 168886 167383 165877 164369 162858 161345 159831 158316 156799 155282 153765 152247 150730 149214 147698 146183
101836 146183 144670 143158 141649 140142 138637 137135 135636 134140 132648 131159 129675 128195 126719 125248 123782 122322 120866 119417 117973 116535 115104
101857 115104 113679 112261 110850 109445 108048 106659 105277 103902 102536 101178 99828 98486 97153 95829 94513 93206 91909 90621 89342 88072 86812
101878 86812 85562 84321 83091 81870 80659 79459 78269 77089 75919 74760 73611 72473 71346 70229 69123 68028 66943 65870 64807 63755 62714 61685
101900 61685 60666 59658 58661 57675 56700 55737 54784 53842 52911 51992 51083 50185 49299 48423 47558 46704 45861 45029 44207 43396 42596 41807 41028 40260 39502 38755 38018 37292
101928 37292 36576 35870 35174 34488 33813 33147 32492 31846 31210 30584 29967 29360 28763 28175 27596 27026 26466 25915 25373 24839 24315 23799 23292 22793 22303 21822 21348 20883 20426
101957B0426m49m41m33m25m18m10m02l95l88l81l73l66l60l52l46l39l33l26l19l14l07l01k95k89k83k77k71k66k61
101986A0306k55k49k45k39k34k29k24k20k14k10k05k01j96j92j88j83j79j75j71j67j64j59j56j52j49j45j42j38j35
102015D790j32j28j26j22j19j17j13j11j08j05j03j00r8r5r2r1q8q5q4q1p9p7p5p3p1p0o7o5o4o2o1n8n7n6n4n2n1n0
102053A550m8m7m6m4m3m2m0l9Tl7l6l5l4l3l2l1l0k9Tk7Tk6k5k4Tk3k2k1Tk0Tj9j8Tj7Tj6j5j6j4Uj3Tj2Uj1Uj0TrVqU
$$ plain form
101957 20426 19977 19536 19103 18678 18260 17850 17448 17053 16665 16284 15911 15545 15185 14833 14487 14148 13815 13489 13170 12856 12549 12248 11953 11664 11381 11104 10833 10567 10306
101986 10306 10051 9802 9557 9318 9084 8855 8631 8411 8197 7987 7782 7581 7385 7193 7005 6822 6643 6468 6297 6130 5966 5807 5651 5499 5350 5205 5063 4925 4790
102015 4790 4658 4530 4404 4282 4163 4046 3933 3822 3714 3609 3506 3406 3308 3213 3121 3030 2942 2857 2773 2692 2613 2536 2461 2388 2317 2247 2180 2115 2051 1989 1928 1870 1813 1757 1703 1651 1600 1550
102053 1550 1502 1455 1409 1365 1322 1280 1240 1201 1162 1125 1089 1054 1020 987 955 924 894 865 836 809 782 756 731 707 683 660 638 617 596 576 556 537 519 501 484 467 451 436 420 406 392 378 365 352 340 328 316 305 294 283 273 263 254 245 236 227 219 211 203
102112B03pVopoTnonVmTnmTlmTlYklklkYjkTjkjTkjS3%jT%jT%j%j%j%Tj%j%Tj%Tj%Uj%Vj%Wj%Yj%S8j%S9J%T4J%S2J%s
102305DJ%ZJ%XJ%WJ%VJ%VJ%VJ%UJ%UJ%UJ%TJ%UJ%TJ%TJ%TJ%TJ%J%TJ%J%TJ%J%TJ%J%J%J%J%J%J%J%J%J%J%JT%J%J%JT%
102420D2J%JT%J%JT%JT%JT%JT%JT%JT%JT%JT%JU%JT%JU%JT%JU%JU%JT%JU%JT%JT%JU%JT%JT%JT%JT%J%JT%J%JT%J%JT%
$$ plain form
102305 4 5 5 5 5 5 5 5 5 5 6 6 6 6 6 6 6 7 7 7 7 7 7 8 8 8 8 8 9 9 9 9 9 10 10 10 10 10 11 11 11 11 12 12 12 12 13 13 13 13 14 14 14 15 15 15 15 16 16 16 17 17 17 18 18 18 19 19 19 20 20 21 21 21 22 22 23 23 23 24 24 25 25 25 26 26 27 27 28 28 29 29 30 30 31 31 32 32 33 33 34 34 35 35 36 36 37 38 38 39 39 40 40 41 42 42
102420 42 43 43 44 45 45 46 46 47 48 48 49 50 50 51 52 52 53 54 54 55 56 56 57 58 58 59 60 60 61 62 62 63 64 65 65 66 67 67 68 69 70 70 71 72 72 73 74 75 75 76 77 78 78 79 80 80 81 82 83 83 84 85 85 86 87 87 88 89 90 90 91 92 92 93 94 94 95 96 96 97 98 98 99 99 100 101 101 102 102 103 104 104 105 105 106 107 107
102517A07J%J%J%J%J%J%J%J%TJ%J%TJ%TJ%TJ%TJ%UJ%UJ%VJ%ZJ%S4j%Zj%Wj%Vj%Uj%Tj%Uj%Tj%Tj%j%Tj%Tj%j%Tj%j%Tj
102641A09%j%j%j%Tj%j%j%j%j%j%j%j%Tj%j%j%j%j%j%j%j%j%j%j%j%Tj%j%j%j%j%j%j%Tj%j%j%j%Tj%j%j%j%Tj%j%Tj%
102731F8j%Tj%j%j%Tj%Tj%j%Tj%j%Tj%Tj%j%Tj%Tj%Tj%Tj%j%Tj%Tj%Tj%Tj%Tj%Tj%Tj%Tj%Tj%Tj%Tj%Tj%Tj%Tj%Tj%Uj
$$ plain form
102641 109 109 108 108 107 107 106 106 106 105 105 104 104 103 103 102 102 101 101 100 100 99 99 98 98 98 97 97 96 96 95 95 94 94 93 93 92 92 91 91 90 90 89 89 88 88 87 87 86 86 86 85 85 84 84 83 83 82 82 81 81 80 80 79 79 79 78 78 77 77 76 76 75 75 75 74 74 73 73 72 72 71 71 71 70 70 69 69 69 68 68
102731 68 67 67 67 66 66 65 65 64 64 64 63 63 63 62 62 61 61 61 60 60 59 59 59 58 58 58 57 57 56 56 56 55 55 55 54 54 54 53 53 53 52 52 51 51 51 50 50 50 49 49 49 48 48 48 47 47 47 46 46 46 45 45 45 44 44 44 43 43 43 42 42 42 41 41 41 40 40 40 39 39 39 38 38 38 37 37 37 36 36 36 36 35
102823C5%Tj%Tj%Tj%Uj%Tj%Tj%Uj%Tj%Uj%Tj%Uj%Uj%Uj%Uj%Uj%Uj%Vj%Vj%Vj%Xj%Yj%T3J%WJ%UJ%TJ%J%TJ%JT%JT%JU%
102963B7JWKJUKJKJKTJKWLKTLTKLUMLMLMVNMNUONOUPOPTQVRQJ0RJ0TJ1TJ2J1J3J2J3J4TJ5UJ6J7TJ8TJ9K0K1UK3TK4K5T
103052G44K7TK8K9L0L1L2L3L5TL6L8TM0M1M3TM5M7M8M9N1N2N4N6N7N9O1O3O4O7O8P0P3P4P7P9Q1Q4Q6Q8R1R3R6R9J02
103098C364J04J08J10J13J17J19J23J27J29J34J36J41J44J48J52J56J60J64J68J73J77J82J86J91J96K01K06K11K17
103127G857K21K28K32K39K44K50K57K62K69K75K82K88K95L02L09L16L23L31L38L47L53L62L70L78L87L95M04M13M21
103156A6948M31M40M49M59M69M78M89M99N09N19N31N41N52N63N74N86N98O09O22O33O46O58O71O83O97P10P23P36P50
103185C3773P64P78P92Q06Q20Q36Q50Q64Q81Q95R11R26R42R58R74R91J006J024J040J056J074J091J108J126J143J161
103211E8590J179J197J215J233J252J270J289J307J327J345J364J384J403J423J441J462J481J501J521J541J561J581
103233H8867J601J621J642J662J682J703J723J743J764J785J805J826J846J867J887J908J929J949J969J990K010K031
$$ plain form
102963 27 28 29 30 31 32 34 35 36 37 39 40 42 43 45 47 48 50 52 54 56 58 61 63 65 68 71 73 76 79 82 86 89 93 96 100 104 108 112 117 121 126 131 136 142 147 153 159 165 172 178 185 192 200 208 216 224 233 241 251 260 270 280 291 302 314 325 338 350 363 377 391 406 421 436 452 469 486 504 522 541 561 582 603 624 647 670 694 719 744
103052 744 771 798 826 855 885 916 948 981 1016 1051 1087 1125 1163 1203 1244 1287 1330 1375 1422 1470 1519 1570 1622 1676 1732 1789 1848 1909 1972 2036 2103 2171 2241 2314 2388 2465 2544 2625 2709 2795 2883 2974 3067 3163 3262 3364
103098 3364 3468 3576 3686 3799 3916 4035 4158 4285 4414 4548 4684 4825 4969 5117 5269 5425 5585 5749 5917 6090 6267 6449 6635 6826 7022 7223 7429 7640 7857
103127 7857 8078 8306 8538 8777 9021 9271 9528 9790 10059 10334 10616 10904 11199 11501 11810 12126 12449 12780 13118 13465 13818 14180 14550 14928 15315 15710 16114 16527 16948
103156 16948 17379 17819 18268 18727 19196 19674 20163 20662 21171 21690 22221 22762 23314 23877 24451 25037 25635 26244 26866 27499 28145 28803 29474 30157 30854 31564 32287 33023 33773
103185 33773 34537 35315 36107 36913 37733 38569 39419 40283 41164 42059 42970 43896 44838 45796 46770 47761 48767 49791 50831 51887 52961 54052 55160 56286 57429 58590
103211 58590 59769 60966 62181 63414 64666 65936 67225 68532 69859 71204 72568 73952 75355 76778 78219 79681 81162 82663 84184 85725 87286 88867
103233 88867 90468 92089 93731 95393 97075 98778 100501 102244 104008 105793 107598 109424 111270 113137 115024 116932 118861 120810 122779 124769 126779 128810
103255A28810K050K071K091K112K131K151K171K190K210K230K249K268K287K306K325K343K362K380K398K416K433
103276A75984K451K469K485K502K518K535K551K566K583K597K612K627K641K655K669K682K695K708K720K732K744
103297B30726K754K766K776K787K795K805K814K823K830K838K844K852K857K864K868K873K878K881K884K887K889
103318B90291K891K892K893UK891K890K888K885K882K879K874K869K863K858K851K843K836K827K818K809K798K788
103341C56102K776K764K751K738K724K710K695K678K663K645K628K610K591K572K552K531K509K488K466K443K419
103362D11055K395K370K345K318K293K265K237K210K180K152K121K091K060K029J996J964J932J897J864J829J794
103383D55397J758J723J686J650J612J574J537J498J459J419J380J340J299J259J218J176J134J092J050J007R64R21
103405D85153Q77Q34P90P45P02O56O12N67N22M77M31L86L40K95K49K03J57J11O6J9k7p2j19j64k11k56l02l47l93m39
$$ plain form
103255 128810 130860 132931 135022 137134 139265 141416 143587 145777 147987 150217 152466 154734 157021 159327 161652 163995 166357 168737 171135 173551 175984
103276 175984 178435 180904 183389 185891 188409 190944 193495 196061 198644 201241 203853 206480 209121 211776 214445 217127 219822 222530 225250 227982 230726
103297 230726 233480 236246 239022 241809 244604 247409 250223 253046 255876 258714 261558 264410 267267 270131 272999 275872 278750 281631 284515 287402 290291
103318 290291 293182 296074 298967 301860 304753 307644 310534 313422 316307 319189 322068 324942 327811 330674 333532 336383 339226 342062 344889 347707 350516 353314 356102
103341 356102 358878 361642 364393 367131 369855 372565 375260 377938 380601 383246 385874 388484 391075 393647 396199 398730 401239 403727 406193 408636 411055
103362 411055 413450 415820 418165 420483 422776 425041 427278 429488 431668 433820 435941 438032 440092 442121 444117 446081 448013 449910 451774 453603 455397
103383 455397 457155 458878 460564 462214 463826 465400 466937 468435 469894 471313 472693 474033 475332 476591 477809 478985 480119 481211 482261 483268 484232 485153
103405 485153 486030 486864 487654 488399 489101 489757 490369 490936 491458 491935 492366 492752 493092 493387 493636 493839 493996 494107 494173 494192 494165 494093 493974 493810 493599 493343 493041 492694 492301 491862
103435D91862m84n29n74o19o64p08p53p96q41q84r28r71j014j056j099j141j183j224j265j306j346j386j426j465
103459D68200j504j543j580j618j655j693j728j764j800j834j869j903j936j970k001k034k065k096k126k156k185
103480D29140k214k242k269k297k323k349k374k398k423k446k470k491k513k535k555k574k594k613k631k648k665
103501C77516k681k697k712k727k740k753k766k778k789k800k810k820k828k837k845k852k858k865k870k874k879
103522C18735k883k885k889k890k892Tk893Tk892k890k889k887k884k880k877k872k868k862k857k850k844k836k829
103545B52601k821k813k803k795k784k775k764k753k742k730k718k706k693k680k666k653k639k625k609k595k580
103566A95657k564k548k532k516k500k482k466k448k430k414k395k377k359k340k322k303k284k265k246k226k207
103587A45433k188k167k148k128k108k088k068k048k027k007j986j966j946j925j905j884j864j843j822j802j781
$$ plain form
103435 491862 491378 490849 490275 489656 488992 488284 487531 486735 485894 485010 484082 483111 482097 481041 479942 478801 477618 476394 475129 473823 472477 471091 469665 468200
103459 468200 466696 465153 463573 461955 460300 458607 456879 455115 453315 451481 449612 447709 445773 443803 441802 439768 437703 435607 433481 431325 429140
103480 429140 426926 424684 422415 420118 417795 415446 413072 410674 408251 405805 403335 400844 398331 395796 393241 390667 388073 385460 382829 380181 377516
103501 377516 374835 372138 369426 366699 363959 361206 358440 355662 352873 350073 347263 344443 341615 338778 335933 333081 330223 327358 324488 321614 318735
103522 318735 315852 312967 310078 307188 304296 301404 298511 295618 292726 289836 286947 284060 281176 278296 275419 272547 269679 266817 263960 261110 258266 255430 252601
103545 252601 249780 246967 244164 241369 238585 235810 233046 230293 227551 224821 222103 219397 216704 214024 211358 208705 206066 203441 200832 198237 195657
103566 195657 193093 190545 188013 185497 182997 180515 178049 175601 173171 170757 168362 165985 163626 161286 158964 156661 154377 152112 149866 147640 145433
103587 145433 143245 141078 138930 136802 134694 132606 130538 128490 126463 124456 122470 120504 118558 116633 114728 112844 110980 109137 107315 105513 103732
103608A03732j761j741j720j699j679j659j638j618j598j578j558j537j518j498j478j458j439j420j400j380j362
103629G0993j342j324j304j286j267j249j230j212j194j176j158j141j123j105j089j071j054j037j021j004r88r71
103651D5647r56r40r24r08q93q78q62q48q33q18q04p90p75p62p48p34p21p07o95o82o68o57o43o32o19o08n96n84n73
103680B3789n61n50n40n28n18n08m97m87m77m67m58m47m39m29m20m12m02l94l85l77l69l60l53l45l37l30l22l15l08
103709A1454l01k94k87k81k74k67k62k55k50k43k38k31k27k21k15k11k05k00j95j91j85j81j77j72j68j63j59j56j51
103738E094j47j44j40j36j33j29j25j23j19j16j13j10j07j04j01r8r6r3r1q8q5q3q1p9p6p4p2p0o8o7o4o2o1n8n7n6n4
103775A614n2n0m9m8m6m5m4m2m1l9Tl7l6l5l4l3l2l1l0k9k8k7k6Tk4Tk3Tk1Tk0Tj9j8Tj7Tj6j5Uj3j4j3Tj2Tj1Tj0j1r
$$ plain form
103608 103732 101971 100230 98510 96811 95132 93473 91835 90217 88619 87041 85483 83946 82428 80930 79452 77994 76555 75135 73735 72355 70993
103629 70993 69651 68327 67023 65737 64470 63221 61991 60779 59585 58409 57251 56110 54987 53882 52793 51722 50668 49631 48610 47606 46618 45647
103651 45647 44691 43751 42827 41919 41026 40148 39286 38438 37605 36787 35983 35193 34418 33656 32908 32174 31453 30746 30051 29369 28701 28044 27401 26769 26150 25542 24946 24362 23789
103680 23789 23228 22678 22138 21610 21092 20584 20087 19600 19123 18656 18198 17751 17312 16883 16463 16051 15649 15255 14870 14493 14124 13764 13411 13066 12729 12399 12077 11762 11454
103709 11454 11153 10859 10572 10291 10017 9750 9488 9233 8983 8740 8502 8271 8044 7823 7608 7397 7192 6992 6797 6606 6421 6240 6063 5891 5723 5560 5401 5245 5094
103738 5094 4947 4803 4663 4527 4394 4265 4140 4017 3898 3782 3669 3559 3452 3348 3247 3149 3053 2960 2869 2781 2696 2613 2532 2453 2377 2303 2231 2161 2093 2026 1962 1900 1839 1781 1724 1668 1614
103775 1614 1562 1512 1463 1415 1369 1324 1280 1238 1197 1158 1119 1082 1046 1011 977 944 912 881 851 822 794 767 741 715 691 667 644 621 600 579 559 539 520 502 484 467 450 434 419 404 389 376 362 349 336 324 312 301 290 280 269 260
103827B60j0rUqTpqpTopoUnTomnTmXlmlVklTkUlkUjkTjkjkjTkjY%jU%jT%j%j%j%Tj%Tj%Uj%Vj%T0J%YJ%WJ%WJ%VJ%UJ%U
103968B3J%UJ%UJ%UJ%UJ%TJ%UJ%TJ%UJ%TJ%TJ%UJ%TJ%TJ%TJ%TJ%TJ%TJ%TJ%TJ%TJ%TJ%TJ%TJ%TJ%TJ%J%TJ%TJ%TJ%J%T
104066E4J%J%TJ%TJ%J%TJ%J%J%TJ%J%J%TJ%J%J%TJ%J%J%J%J%J%TJ%J%J%J%J%J%J%J%J%J%JT%J%J%J%J%J%J%J%J%JT%J%
$$ plain form
103968 23 24 24 24 24 25 25 25 25 26 26 26 26 27 27 27 27 28 28 28 29 29 29 29 30 30 30 31 31 31 31 32 32 32 33 33 33 34 34 34 34 35 35 35 36 36 36 37 37 37 38 38 38 39 39 39 40 40 40 41 41 41 42 42 42 43 43 43 44 44 44 45 45 45 46 46 46 47 47 47 48 48 48 49 49 50 50 50 51 51 51 52 52 52 53 53 54 54 54
104066 54 55 55 56 56 56 57 57 57 58 58 59 59 59 60 60 61 61 62 62 62 63 63 64 64 65 65 65 66 66 67 67 68 68 68 69 69 70 70 71 71 72 72 73 73 74 74 74 75 75 76 76 77 77 78 78 79 79 80 80 81 81 82 82 83 83 84 84 85 86 86 87 87 88 88 89 89 90 90 91 91 92 92 93 93 94 94 95 96 96 97 97
104157I7J%J%J%J%JT%J%J%J%J%J%J%J%J%J%J%J%J%J%TJ%J%J%J%TJ%J%TJ%TJ%TJ%TJ%TJ%UJ%UJ%VJ%XJ%T0j%Xj%Vj%Uj%T
104281A27j%Tj%Tj%Tj%j%Tj%j%j%j%j%j%j%j%jT%j%jT%j%jT%jT%jT%jU%jT%jT%jU%jU%jU%jU%jU%jU%jU%jU%jU%jU%jU
104383F2%jU%jT%jT%jU%jT%jT%j%jT%jT%jT%j%j%jT%j%j%jT%j%j%j%j%j%j%Tj%j%j%j%Tj%j%Tj%j%Tj%Tj%Tj%Tj%Uj%T
$$ plain form
104281 127 126 126 126 125 125 125 124 124 124 123 123 122 122 122 121 121 120 120 119 119 118 118 117 117 116 116 115 115 114 114 113 112 112 111 111 110 109 109 108 108 107 106 106 105 104 104 103 102 102 101 100 99 99 98 97 97 96 95 95 94 93 92 92 91 90 89 89 88 87 86 86 85 84 83 83 82 81 80 80 79 78 77 77 76 75 74 74 73 72 71 71 70 69 68 68 67 66 65 65 64 63 62
104383 62 62 61 60 59 59 58 57 57 56 55 55 54 53 52 52 51 50 50 49 48 48 47 47 46 45 45 44 43 43 42 41 41 40 40 39 39 38 37 37 36 36 35 35 34 33 33 32 32 31 31 30 30 29 29 28 28 27 27 27 26 26 25 25 24 24 23 23 23 22 22 21 21 21 20 20 19 19 19 18 18 18 17 17 17 16 16 16 15 15 15 15 14 14 14
104477A4j%Uj%Uj%Uj%Uj%Vj%Wj%Wj%Xj%Yj%sj%S1j%S9j%W3J%S2J%YJ%WJ%UJ%UJ%TJ%TJ%TJ%J%J%J%JT%JT%JW%JTKJWKJ
104695C4KJKJKsLKLKLWMLMTLMNMTNWOWPVQVRTJ0RJ0J1J0J1J2VJ4J3J4TJ5J6UJ7TJ8J9TK0K1UK3TK4K5TK6K7K8K9L0TL2T
104786A005L3L5TL7TL9TM1M3TM5M6M7M8N0N2N3N4N6N8N9O1O2O4O6O8O9P2P3P6P7Q0Q1Q4Q6Q8R1R3R5R8J00J03J06J08
104830C856J11J13J17J19J23J25J29J32J35J38J41J45J49J52J55J59J63J67J71J74J79J83J87J91J95K00K04K09K13
104859H435K19K22K28K33K38K42K48K54K58K64K70K75K81K86K92K99L04L10L17L23L29L36L42L48L56L62L69L76L84
104888A7000L90L97M05M12M20M27M35M43M50M59M66M75M82M91M99N08N16N25N33N42N51N59N69N78N86N96O05O15O23
104917C1557O34O42O53O62O71O81O92P01P10P21P31P41P51P61P71P82P92Q02Q12Q23Q33Q43Q54Q65Q74Q86Q95R07R16
104946E3963R27R38R48R59R69R79R90J000J011J021J031J042J051J062J072J082J093J102J112J122J132J141J151
104969G7898J161J170J179J189J198J207J216J224J234J242J251J259J267J275J283J291J299J306J314J321J328J334
$$ plain form
104695 34 36 37 39 40 42 44 46 48 50 52 54 56 58 61 63 66 68 71 74 77 80 83 87 90 94 98 101 105 110 114 118 123 128 133 138 143 149 155 161 167 173 180 187 194 201 209 217 225 233 242 251 261 270 280 291 301 312 324 336 348 360 374 387 401 415 430 446 462 478 495 512 530 549 568 588 609 630 651 674 697 721 746 771 797 824 852 881 911 941 973 1005
104786 1005 1038 1073 1108 1145 1182 1221 1260 1301 1344 1387 1432 1478 1525 1573 1623 1675 1728 1782 1838 1896 1955 2016 2078 2142 2208 2276 2345 2417 2490 2566 2643 2723 2804 2888 2974 3062 3153 3246 3341 3439 3539 3642 3748 3856
104830 3856 3967 4080 4197 4316 4439 4564 4693 4825 4960 5098 5239 5384 5533 5685 5840 5999 6162 6329 6500 6674 6853 7036 7223 7414 7609 7809 8013 8222 8435
104859 8435 8654 8876 9104 9337 9575 9817 10065 10319 10577 10841 11111 11386 11667 11953 12245 12544 12848 13158 13475 13798 14127 14463 14805 15153 15509 15871 16240 16616 17000
104888 17000 17390 17787 18192 18604 19024 19451 19886 20329 20779 21238 21704 22179 22661 23152 23651 24159 24675 25200 25733 26275 26826 27385 27954 28532 29118 29714 30319 30934 31557
104917 31557 32191 32833 33486 34148 34819 35500 36192 36893 37603 38324 39055 39796 40547 41308 42079 42861 43653 44455 45267 46090 46923 47766 48620 49485 50359 51245 52140 53047 53963
104946 53963 54890 55828 56776 57735 58704 59683 60673 61673 62684 63705 64736 65778 66829 67891 68963 70045 71138 72240 73352 74474 75606 76747 77898
104969 77898 79059 80229 81408 82597 83795 85002 86218 87442 88676 89918 91169 92428 93695 94970 96253 97544 98843 100149 101463 102784 104112 105446
104991A05446J342J348J354J360J366J372J378J383J388J393J397J403J406J411J414J418J421J424J427J430J432
105012A34713J434J436J438J439J440TJ442J441UJ440TJ438J437J435J432J431J427J425J421J418J413J410J405J400
105037A70477J395J389J383J378J371J364J357J349J342J334J325J317J308J298J289J278J269J257J247J236J224
105058A98187J212J200J188J175J161J148J135J121J106J092J076J062J046J031J014R98R82R65R48R30R13Q95Q77Q58
105082B23320Q40Q21Q02P83P64P43P24P04O83O63O42O21O00N79N58N36N14M92M71M48M26M04L81L58L36L13K90K67K44
105111B39327K21J97J75J51J27J04Q1N8L4J0j3l7o0q3j07j30j54j77k00k24k46k70k92l16l38l61l84m06m28m51m73
105142B35335m95n17n38n60n81o03o23o45o65o86p06p26p45p66p85q04q24q42q60q79q97r15r32r50r67r83j000j017
105170B13824j032j048j063j079j093j108j122j136j150j163j176j189j202j213j226j237j248j259j269j280j290
$$ plain form
104991 105446 106788 108136 109490 110850 112216 113588 114966 116349 117737 119130 120527 121930 123336 124747 126161 127579 129000 130424 131851 133281 134713
105012 134713 136147 137583 139021 140460 141900 143340 144782 146223 147664 149105 150545 151985 153423 154860 156295 157727 159158 160585 162010 163431 164849 166262 167672 169077 170477
105037 170477 171872 173261 174644 176022 177393 178757 180114 181463 182805 184139 185464 186781 188089 189387 190676 191954 193223 194480 195727 196963 198187
105058 198187 199399 200599 201787 202962 204123 205271 206406 207527 208633 209725 210801 211863 212909 213940 214954 215952 216934 217899 218847 219777 220690 221585 222462 223320
105082 223320 224160 224981 225783 226566 227330 228073 228797 229501 230184 230847 231489 232110 232710 233289 233847 234383 234897 235389 235860 236308 236734 237138 237519 237877 238213 238526 238816 239083 239327
105111 239327 239548 239745 239920 240071 240198 240302 240383 240441 240475 240485 240472 240435 240375 240292 240185 240055 239901 239724 239524 239300 239054 238784 238492 238176 237838 237477 237093 236687 236259 235808 235335
105142 235335 234840 234323 233785 233225 232644 232041 231418 230773 230108 229422 228716 227990 227245 226479 225694 224890 224066 223224 222364 221485 220588 219673 218741 217791 216824 215841 214841 213824
105170 213824 212792 211744 210681 209602 208509 207401 206279 205143 203993 202830 201654 200465 199263 198050 196824 195587 194339 193080 191811 190531 189241
105191A89241j299j309j318j326j335j342j351j358j364j372j378j384j390j396j400j406j410j414j418j421j425
105212A60425j428j431j433j435j437j438j439j441Uj442j441j440Tj439j437j436j434j432j429j427j424j421j417
105236A26002j414j410j406j402j397j392j388j382j377j371j366j359j354j347j341j334j327j319j313j306j298
105257I7399j290j282j274j267j258j249j241j233j224j214j206j197j188j178j169j160j149j141j130j121j111j101
105279G1016j091j081j071j061j050j041j030j019j010r99r88r79r67r58r47r36r26r15r05q95q84q73q63q53q42q32
105305D6000q21q11q01p91p80p70p60p50p40p29p20p09p00o90o80o71o60o51o42o32o23o13o04n95n85n77n67n59n49
105334B6220n41n32n24n15n06m98m90m82m73m65m58m49m42m34m26m19m11m04l96l89l83l75l68l61l55l48l41l35l28
105363A3772l22l15l10l03k98k91k86k80k74k69k63k57k53k47k42k37k32k27k22k17k13k08k04j99j94j91j86j82j78
$$ plain form
105191 189241 187942 186633 185315 183989 182654 181312 179961 178603 177239 175867 174489 173105 171715 170319 168919 167513 166103 164689 163271 161850 160425
105212 160425 158997 157566 156133 154698 153261 151823 150384 148943 147502 146061 144619 143178 141738 140298 138859 137422 135986 134552 133120 131691 130264 128840 127419 126002
105236 126002 124588 123178 121772 120370 118973 117581 116193 114811 113434 112063 110697 109338 107984 106637 105296 103962 102635 101316 100003 98697 97399
105257 97399 96109 94827 93553 92286 91028 89779 88538 87305 86081 84867 83661 82464 81276 80098 78929 77769 76620 75479 74349 73228 72117 71016
105279 71016 69925 68844 67773 66712 65662 64621 63591 62572 61562 60563 59575 58596 57629 56671 55724 54788 53862 52947 52042 51147 50263 49390 48527 47674 46832 46000
105305 46000 45179 44368 43567 42776 41996 41226 40466 39716 38976 38247 37527 36818 36118 35428 34748 34077 33417 32766 32124 31492 30869 30256 29652 29057 28472 27895 27328 26769 26220
105334 26220 25679 25147 24623 24108 23602 23104 22614 22132 21659 21194 20736 20287 19845 19411 18985 18566 18155 17751 17355 16966 16583 16208 15840 15479 15124 14776 14435 14100 13772
105363 13772 13450 13135 12825 12522 12224 11933 11647 11367 11093 10824 10561 10304 10051 9804 9562 9325 9093 8866 8644 8427 8214 8006 7802 7603 7409 7218 7032 6850 6672
105392F672j74j70j66j62j58j55j52j47j45j40j38j34j31j28j25j22j19j16j13j10j08j05j02j00r7r5r2r0q8q5q3q1
105424B741p9p7p5p3p1o9o7o6o3o2o1n8n7n6n4n2n1m9Tm6Tm4m3m2m0Tl8l7l6l5l4l3l2l1l0k9k8Tk7k5Uk3Tk2Tk0Uj9
105474E89j8Tj7Tj6j5Uj4Tj3Tj2Tj1j2j0j1j0TrUqrqpqpTopoUnonVmTnmTlmlmlXklklkZjkjkjkjkjVkjX%jW%jT%jT%jT
105576E9%j%jT%j%j%j%j%Tj%j%j%j%Tj%j%Tj%j%Tj%Tj%j%Tj%Tj%Tj%Tj%j%Tj%Tj%Tj%Tj%Tj%Tj%Tj%Tj%Tj%Tj%Uj%Tj%T
$$ plain form
105392 6672 6498 6328 6162 6000 5842 5687 5535 5388 5243 5103 4965 4831 4700 4572 4447 4325 4206 4090 3977 3867 3759 3654 3552 3452 3355 3260 3168 3078 2990 2905 2822 2741
105424 2741 2662 2585 2510 2437 2366 2297 2230 2164 2101 2039 1978 1920 1863 1807 1753 1701 1650 1601 1552 1506 1460 1416 1373 1331 1291 1251 1213 1176 1140 1105 1071 1038 1006 975 945 916 888 860 833 808 783 758 735 712 690 668 648 628 608 589
105474 589 571 553 536 519 503 488 473 458 444 430 417 404 392 380 369 357 347 336 326 316 307 298 289 281 272 264 257 249 242 235 229 222 216 210 204 199 193 188 183 178 173 169 165 160 156 152 149 145 142 138 135 132 129 126 123 120 118 115 113 110 108 106 104 102 100 98 96 94 93 91 90 88 87 85 84 82 81 80 79 78 76 75 74 73 72 71 70 70 69 68 67 66 65 65 64 63 63 62 61 61 60 59
105576 59 59 58 58 57 56 56 55 55 54 54 53 53 52 52 52 51 51 50 50 49 49 48 48 48 47 47 46 46 46 45 45 44 44 44 43 43 43 42 42 41 41 41 40 40 40 39 39 39 38 38 38 37 37 36 36 36 35 35 35 34 34 34 33 33 33 32 32 32 31 31 31 30 30 30 29 29 29 28 28 28 27 27 27 26 26 26 26 25 25 25 24 24 24
105669B4j%Uj%Tj%Uj%Tj%Uj%Uj%Uj%Uj%Uj%Uj%Vj%Vj%Vj%Wj%Wj%Wj%Xj%Yj%sj%S0j%S3j%S9j%U8j%U09J%V2J%T2J%S6J
106243D%S2J%S0J%sJ%ZJ%ZJ%XJ%YJ%XJ%XJ%XJ%XJ%WJ%XJ%XJ%XJ%XJ%XJ%YJ%ZJ%S0J%S4J%V2j%S4j%S0j%Zj%Yj%Xj%Xj%X
106528A8j%Xj%Xj%Wj%Xj%Xj%Xj%Xj%Xj%Yj%Zj%Zj%sj%S0j%S2j%S6j%T2j%V2j%S55416
262143@
##END= 